﻿"Item Id","Item URI","Dublin Core:Title","Dublin Core:Date","Dublin Core:Creator","Dublin Core:Contributor","Dublin Core:Description","Dublin Core:Type","Dublin Core:Subject","Dublin Core:Coverage","Dublin Core:Language","Dublin Core:Relation","Dublin Core:Source","Dublin Core:Format","Dublin Core:Identifier","Dublin Core:Rights","Dublin Core:Publisher","Item Type Metadata:Original Format","PDF Text:Text",tags,file,itemType,collection,public,featured
7714,https://ccnydigitalscholarship.org/kofiannan/items/show/7714,"Reform the DPKO","13 June 2000","Kofi Annan",,"The reorganization and strengthening of the Department of Peacekeeping Operations. Within the letter is a proposed plan.",Letter,"United Nations|United Nations. Secretary-General|Annan, Kofi A. (Kofi Atta)|Letter; Richard Holbrooke; Sergey Lavrov","United States",English,,"United Nations|DPKO Department of Peacekeeping Operations 2000 (Jan-Aug)",PDF,UN0687,"United Nations",,,,,https://ccnydigitalscholarship.org/kofiannan/files/original/5b032764c9f3f648400d0681d9a0f723.PDF,Text,Letters,1,0
7715,https://ccnydigitalscholarship.org/kofiannan/items/show/7715,"In Reference to the Forthcoming 4th High Level Meeting","12 June 2000","Kofi Annan",,"Writing to inform the president of postponing the forthcoming 4th High Level Meeting between the United Nations and Regional Organizations scheduled to take place in New York on 20-21 June. An urgent mission is to be undertaken in the Middle East, causing this meeting to be rescheduled.",Letter,"United Nations|United Nations. Secretary-General|Annan, Kofi A. (Kofi Atta)|Jean-David Levitte",United States,English,,"United Nations|DPA 2000",PDF,UN0686,"United Nations",,,,,https://ccnydigitalscholarship.org/kofiannan/files/original/7f0fb27338baed09120cb52ed4a25573.PDF,Text,Letters,1,0
7735,https://ccnydigitalscholarship.org/kofiannan/items/show/7735,"Letter from Kofi Annan to Michael Douglas, the UN Messenger of Peace, thanking for Michael Douglas's contribution to the UN","8 March 2001","Kofi Annan",,"Letter from Kofi Annan to Michael Douglas, the UN Messenger of Peace, thanking for Michael Douglas's contribution to the United Nations' disarmament programme.",Letter,"United Nations|United Nations. Secretary-General|Annan, Kofi A. (Kofi Atta)|Disarmament; UNA-USA; Messenger of Peace; Douglas, Michael; Department for Disarmament Affairs (DDA)","United States",English,,"United Nations|Disarmament 2001 - DDA - Jan - Aug",PDF,UN0829,"United Nations","United Nations",,,,https://ccnydigitalscholarship.org/kofiannan/files/original/1e5d7ffb6e1a7bcdf1f719cea36fa917.pdf,Text,Letters,1,0
8286,https://ccnydigitalscholarship.org/kofiannan/items/show/8286,"Letter to Joseph E. Connor, Under- Secretary- General for Management","2 April 1997","Kofi Annan",,"Inter-office memorandum from Joseph E. Connor, Under-Secretary-General for Management, to Secretary-General Kofi Annan regarding an accelerated process of managerial reform.|Note: Handwritten note by Kofi Annan: ""This report could be issued by the USG of DAM, as part of an group search for efficiency. Either reports had been issued.""","Internal memo",,"United States",English,,"United Nations",PDF,UN0028,"United Nations",,Memorandums,,"Internal memo,Joseph E. Connor,United States",https://ccnydigitalscholarship.org/kofiannan/files/original/bf661fad0c546f2fd3e26f4df9a2706a.pdf,Text,"Internal Memo",1,0
8996,https://ccnydigitalscholarship.org/kofiannan/items/show/8996,"Letter from Kofi Annan to Rudolph W. Giuliani, Mayor of New York City, regarding the the Millennium Summit","8 September 2000","Kofi Annan",,"Letter from Secretary-General Kofi Annan to Rudolph W. Giuliani, Mayor of New York City, conveying Annan's gratitude to the City of New York for its contribution to the Millennium Summit.","Internal memo",,"United States",English,,"United Nations|UN Archive Collection: DGAACS - Millenium File - part 2 - 2000",PDF,UN0741,"United Nations",,Memorandums,,"Internal memo,Millennium Summit,United States",https://ccnydigitalscholarship.org/kofiannan/files/original/51983f8248e3a5a1ea934849bb0a5540.PDF,Text,"Internal Memo",1,0
7887,https://ccnydigitalscholarship.org/kofiannan/items/show/7887,"Secretary-General Says We Will Not Defeat Terrorism Without Working Together","8 October 2001","Kofi Annan and Al-Hayat",,"Unofficial transcript of an interview with Secretary-General Kofi Annan by international daily Al-Hayat in which they discuss the terrorist attacks on September 11, 2001, the tension between the concepts of terrorism and resistance against occupation, and Annan addresses the suspected involvement of Osama Bin Laden, and Al-Qaeda who may be the alleged planners of the attacks.",Interview,"United Nations|United Nations Secretary-General|Annan|Kofi A. (Kofi Atta)|International terrorism|United States|Sharon|Ariel|Security Council resolution 1373|Osama Bin Laden|Al-Qaida|Afghanistan|Israeli-Palestinian conflict","Middle East|Iraq|Afghanistan|United States",English,,"United Nations",PDF,UN9190,"United Nations",Al-Hayat,,,"Afghanistan,Al-Qaida,Ariel Sharon,International Terrorism,Interview,Iraq,Israeli-Palestinian Conflict,Middle East,Osama bin Laden,Security Council Resolution 1373,United States",https://ccnydigitalscholarship.org/kofiannan/files/original/5c6316ff9e5ab70d759a839ae8b4acad.pdf,Text,Interviews,1,0
7901,https://ccnydigitalscholarship.org/kofiannan/items/show/7901,"Interview with Gwen Ifill that aired on PBS NewsHour","18 October 1999","Kofi Annan with Gwen Ifill",,"Transcript of an interview with Secretary-General Kofi Annan by Gwen Ifill of the PBS News Hour program. Topics include humanitarian intervention, East Timor, Sierra Leone, and US UN dues among others.",Interview,"United Nations|United Nations Secretary-General|Annan|Kofi A. (Kofi Atta)|Human rights|East Timor and Human rights in East Timor|Humanitarian intervention|Intrastate conflict|UN Security Council|International Criminal Tribunal for Rwanda (ICTR)|International Criminal Tribunal for the Former Yugoslavia (ICTY)|Peacekeeping|North Atlantic Treaty Organization (NATO)|Bond between NATO and the UN|Kosovo|Sierra Leone|United States|Richard Holbrooke","Kosovo|Sierra Leone|United States|East Timor",English,,"United Nations",PDF,UN9185,"United Nations",PBS,,,"Bond between NATO and the UN,East Timor,Human Rights,Humanitarian Intervention,International Criminal Tribunal For Rwanda (ICTR),International Criminal Tribunal For The Former Yugoslavia (ICTY),Interview,Intrastate Conflict,Kosovo,North Atlantic Treaty Organization (NATO),Peacekeeping,Richard Holbrooke,Sierra Leone,UN Security Council,United States",https://ccnydigitalscholarship.org/kofiannan/files/original/ee5ebde18c4da2b702e13bf94be70918.pdf,Text,Interviews,1,0
7896,https://ccnydigitalscholarship.org/kofiannan/items/show/7896,"Interview with the Secretary-General by Tom Brokaw of NBC","16 September 2001","Kofi Annan with Tom Brokaw of NBC",,"Unofficial transcript of an interview with Secretary-General Kofi Annan by Tom Brokaw a few days after the attacks on September 11 (9/11), 2001 and they are discussing the Security Council and General Assembly resolutions passed in the last few days.",Interview,"United Nations|United Nations Secretary-General|Annan|Kofi A. (Kofi Atta)|Terrorism|Security Council|General Assembly|Fight against terrorism|Afghanistan|Pakistan|United States|International Criminal Court (ICC)|9/11 terrorist attacks","Afghanistan|Pakistan|United States",English,,"United Nations",PDF,UN9188,"United Nations",NBC,,,"Afghanistan,Fight Against Terrorism,General Assembly,International Criminal Court (ICC),Interview,Pakistan,Security Council,September 11 attacks,Terrorism,United States",https://ccnydigitalscholarship.org/kofiannan/files/original/3d367f1b3a99fd9dcbfa1871cab06888.pdf,Text,Interviews,1,0
7236,https://ccnydigitalscholarship.org/kofiannan/items/show/7236,"Letter from Richard C. Hollbrooke to Secretary-General Kofi Annan regarding the organizational structure of the Department of Peacekeeping Operations (DPKO)","5 June 2000","Kofi Annan; Executive Office of the UN Secretary-General",,"Letter from Richard C. Hollbrooke, US Representative to the United Nations, to Secretary-General Kofi Annan regarding the replacement of Bernard Miyet and proposing an organizational restructuring of the Department of Peacekeeping Operations (DPKO) including adding a new role: Deputy Under-Secretary-General for Peacekeeping to assist in coordination. Hollbrooke attached a proposed DPKO organizational chart. ",Letter,"United Nations|United Nations. Secretary-General|Annan, Kofi A. (Kofi Atta)|Kofi Annan; Kofi Annan and Kofi Annan as head of DPKO","United States",English,,"United Nations|DPKO Department of Peacekeeping Operations 2000 (Jan-Aug)",PDF,UN0680,"United Nations",,"Letters (Correspondence)",,,https://ccnydigitalscholarship.org/kofiannan/files/original/f0d3d63d01b68ac2a2345b7baf5cb0da.PDF,Text,Letters,1,0
7199,https://ccnydigitalscholarship.org/kofiannan/items/show/7199,"Note to the Secretary-General: Proposal to Establish a Minimum Age for Participation of Military/Civilian Police Personnel in UN Peacekeeping Operations","30 September 1998","Miyet, Bernard",,"Note from Bernard Miyet, Under-Secretary-General for Peacekeeping, to Secretary-General Kofi Annan regarding the minimum age requirements for military and civilian police personnel to serve as UN Peacekeepers","Internal memo",,"United States",English,,"United Nations|DPKO Office of Peacekeeping Operations 1998",PDF,UN0301,"United Nations",,Memorandums,,"Bernard Miyet,Civilian Police,Civilian Police (CIVPOL),Department Of Peacekeeping Operations (DPKO),Internal memo,Minimum Age For Peacekeepers,Peacekeeping,Police,Senior Management Group (SMG),United States",https://ccnydigitalscholarship.org/kofiannan/files/original/0e31a3702ec71121f32f1a0c0f20c403.PDF,Text,"Internal Memo",1,0
9075,https://ccnydigitalscholarship.org/kofiannan/items/show/9075,"High-Level ECOSOC meeting with the Bretton Woods Institution","24 February 2000","Nitin Desai",,"Note from Nitin Desai, Under-Secretary-General for Economic and Social Affairs, to Secretary-General Kofi Annan about a high-level Economic and Social Council (ECOSOC) meeting with the Bretton Woods Institutions on 18 April 2000. This was the third such meeting between them.","Internal memo",,"United States",English,,"United Nations|DESA ECOSOC 2000",PDF,UN0621,"United Nations",,Memorandums,,"Bretton Woods Institutions,Economic and Social Council (ECOSOC),Internal memo,Meeting,United States",https://ccnydigitalscholarship.org/kofiannan/files/original/2314c03bd9d8f35d0b0adc436ece046c.PDF,Text,"Internal Memo",1,0
5026,https://ccnydigitalscholarship.org/kofiannan/items/show/5026,"The Secretary-General's Private Appointments","20 November 2000","S. Iqbal Riza|Fred Eckhard (spokesperson and creator of the noon briefing)",,"Fred Eckhard would like a list of all the private events the SG attends.","Internal memo",,"United States",English,,"United Nations|EOSG Office of the Spokesman 1999-2001",PDF,UN0770,"United Nations",,Memorandums,,"BBC World Service,Internal memo,Private Sector,S. Iqbal Riza,United States",https://ccnydigitalscholarship.org/kofiannan/files/original/9bd6d4804ab6f93d638a0342f9e3a078.pdf,Text,"Internal Memo",1,0
6410,https://ccnydigitalscholarship.org/kofiannan/items/show/6410,"Confidential note to Karl Paschke","6 April 1998","S. Iqbal Riza",,"Letter from S. Iqbal Riza, Chef de Cabinet for Secretary-General Kofi Annan, to Karl Paschke, asking his office to undertake a preliminary study of dealing with assuring the confidentiality of official documents in the Secretariat","Internal memo",,"United States",English,,"United Nations|EOSG: General 1998",PDF,UN0192,"United Nations",,Memorandums,,"Confidentiality,Internal memo,United States",https://ccnydigitalscholarship.org/kofiannan/files/original/534f1ac25da1ce5cf4a0897b5cdbc1d9.PDF,Text,"Internal Memo",1,0
6449,https://ccnydigitalscholarship.org/kofiannan/items/show/6449,"Note to Mr. Turk on Middle East with Attached Letter to Kofi Annan","21 January 2002","S. Iqbal Riza",,"This is a note to Mr. Turk from S. Iqbal Riza sent on 21 January 2002 with an attached letter to Kofi Annan from Yitzhak Frankenthal regarding permission to re create an art installation of of coffins draped in Palestinian and Israeli flags in front of the UN, as well as requesting a meeting to discuss this proposition.","Internal memo",,"Israel|United States",English,,"United Nations|DPA Department of Political Affairs 2002",PDF,UN1027,"United Nations",,Memorandums,,"Internal memo,Israel,Middle East,Middle East peace process and Israeli-Palestine conflict,Palestine,S. Iqbal Riza,United States",https://ccnydigitalscholarship.org/kofiannan/files/original/a7d0b874792b9a97bf95e2dc1ec81b9c.PDF,Text,"Internal Memo",1,0
7387,https://ccnydigitalscholarship.org/kofiannan/items/show/7387,"Letter from S. Iqbal Riza to the heads of the principal organs of the UN regarding the meeting and luncheon","21 October 1998","S. Iqbal Riza",,"Letter from S. Iqbal Riza to the heads of the principal organs of the UN, informing the schedule of the meeting and luncheon",Letter,"United Nations|United Nations. Secretary-General|Annan, Kofi A. (Kofi Atta)|Lamin J. Sise; United Nations, Meeting of the heads of principal organs","United States",English,,"United Nations|EOSG: General 1998",PDF,UN0325,"United Nations","United Nations","Letters (Correspondence)",,,https://ccnydigitalscholarship.org/kofiannan/files/original/f55688ee213c4ab058e2fed9f5bd4e84.PDF,Text,Letters,1,0
7616,https://ccnydigitalscholarship.org/kofiannan/items/show/7616,"Personal Letter Exchange Between S. Iqbal Riza and James Sutterlin","3 March 1998","S. Iqbal Riza",,"Personal letter exchange between S. Iqbal Riza and James S. Sutterlin in regards to the hiring of a special representative to record the history of the Secretary-General's important developments.",Letter,"United Nations|United Nations. Secretary-General|Annan, Kofi A. (Kofi Atta)|Kofi Annan; UN Secretary-General; UN history; Sutterlin. James S.; S. Iqbal Riza; Executive Office of the Secretary-General (EOSG)","United States",English,,"United Nations|EOSG: General 1998",PDF,UN0183,"United Nations",,,,,https://ccnydigitalscholarship.org/kofiannan/files/original/dba82155c30186413ce0bf4b9c8551ae.PDF,Text,Letters,1,0
8293,https://ccnydigitalscholarship.org/kofiannan/items/show/8293,"Analytical Summaries of Major Political Statements during the General Debate","18 September 1997","S. Iqbal Riza",,"Inter-office memorandum from S. Iqbal Riza, Chef de Cabinet for Secretary-General Kofi Annan, to Kieran Prendergast, Under-Secretary-General for Political Affairs and Jin Yong Jian, Under-Secretary-General for General Assembly Affairs and Conference Services requesting the Department of Political Affairs (DPA) to prepare brief daily summaries on the points of major political significance made at the general debate.","Internal memo",,"United States",English,,"United Nations|UN Archive Collection: EOSG Executive Office of the Secretary General 1997",PDF,UN0106,"United Nations",,Memorandums,,"Department of General Assembly Affairs and Conference Services,Department Of Political Affairs (DPA),General Debate,Internal memo,United States",https://ccnydigitalscholarship.org/kofiannan/files/original/b72e23062ec4bf41e2013a5a8ce2b467.pdf,Text,"Internal Memo",1,0
8296,https://ccnydigitalscholarship.org/kofiannan/items/show/8296,"Note from S. Iqbal Riza to the Kieran Prendergast regarding the Regional Organizations","16 April 1998","S. Iqbal Riza",,"Internal note from the Secretary-General's Chef de Cabinet, S. Iqbal Riza, to the Under-Secretary-General for Political Affairs, Kieran Prendergast regarding the regional organizations|Note: Handwritten note by Kofi Annan: ""I believe that given our recent cooperation with NATO in the Balkans it would be appropriate to invite them. Francophonie is transforming itself along the lines of Commonwealth|it should be invited along with the Council of Europe and WEU. Thanks.""","Internal memo",,"United States",English,,"United Nations|UN Archive Collection: DPA Department of Political Affairs 1998",PDF,UN0201,"United Nations",,Memorandums,,"Association Of Southeast Asian Nations (ASEAN),Bernard Miyet,Boutros Boutros-Ghali,Caribbean Community (CARICOM),Commonwealth Of Independent States (CIS),Conflict Prevention,Department Of Peacekeeping Operations (DPKO),Department Of Political Affairs (DPA),Economic Community Of West African States (ECOWAS),European Union (EU),Francophonie,Internal memo,LAS,North Atlantic Treaty Organization,Office For The Coordination Of Humanitarian Affairs (OCHA),Organization for Security and Cooperation in Europe (OSCE),Organization Of African Unity (OAU),Organization Of The Islamic Conference (OIC),Regional Organizations,United States,WEU",https://ccnydigitalscholarship.org/kofiannan/files/original/9b9ad0529d66c464206a864d02c71deb.PDF,Text,"Internal Memo",1,0
8776,https://ccnydigitalscholarship.org/kofiannan/items/show/8776,"Standard Directives for Special Representatives of the Secretary-General","2 September 1998","S. Iqbal Riza",,"Note from S. Iqbal Riza to Annabi Hedi, approving the text of the standard directives for Special Representatives of the Secretary-General heading multidimensional peacekeeping operations","Internal memo",,"United States",English,"Annabi's note of 31 August 1998 and the draft Standard Directives for SRSGs","United Nations|UN Archive Collection: DPKO Department of Peacekeeping Operations 1998",PDF,UN0278,"United Nations",,Memorandums,,"Internal memo,SRSG,Standard Directives For Special Representatives Of The Secretary-General,United States",https://ccnydigitalscholarship.org/kofiannan/files/original/a668f6b844fc5bdec222df4c6fd3f38d.PDF,Text,"Internal Memo",1,0
8778,https://ccnydigitalscholarship.org/kofiannan/items/show/8778,"Note to the Secretary-General: Heads of the Principal Organs","24 September 1998","S. Iqbal Riza",,"Internal memo from S. Iqbal Riza to Kofi Annan suggesting to hold an informal lunch meeting with the heads of the principal organs to exchange views on United Nations reform and related matters","Internal memo",,"United States",English,,"United Nations|UN Archive Collection: EOSG: General 1998",PDF,UN0298,"United Nations",,Memorandums,,"Didier Opertti,Economic and Social Council (ECOSOC),Hubert Legal,Internal memo,International Court Of Justice (ICJ),Jeremy Greenstock,Juan Somavía,Stephen M. Schwebel,Trusteeship Council,United States",https://ccnydigitalscholarship.org/kofiannan/files/original/2d4375cf7a77774709a65882c817f5d4.PDF,Text,"Internal Memo",1,0
8785,https://ccnydigitalscholarship.org/kofiannan/items/show/8785,"Note to the Secretary-General","4 August 1998","S. Iqbal Riza",,"Internal note from the Secretary-General's Chef de Cabinet, S. Iqbal Riza, regarding clarification of the relationship between the Department of Political Affairs (DPA) and the Department of the Peacekeeping Operations (DPKO)|Note: Handwritten note by Kofi Annan: ""Approved. -K.A., 4/8""","Internal memo",,"United States",English,,"United Nations|UN Archive Collection: DPA Department of Political Affairs 1998",PDF,UN0263,"United Nations",,Memorandums,,"Department Of Peacekeeping Operations (DPKO),Department Of Political Affairs (DPA),Internal memo,United States",https://ccnydigitalscholarship.org/kofiannan/files/original/1ccc62d016f1e164ea09244672210fca.PDF,Text,"Internal Memo",1,0
8787,https://ccnydigitalscholarship.org/kofiannan/items/show/8787,"Note from S. Iqbal Riza to Connor regarding the letter from the Permanent Representative of the United States","13 August 1998","S. Iqbal Riza",,"Note from S. Iqbal Riza to Connor asking his advice to the Secretary-General regarding the letter from Bill Richardson, Permanent Representative of the United States to the UN about the budget outline for the biennium 2000-2001","Internal memo",,"United States",English,,"United Nations|UN Archive Collection: OIOS Office of Internal Oversight Services 1998",PDF,UN0269,"United Nations",,Memorandums,,"Internal memo,UN Budget,United States",https://ccnydigitalscholarship.org/kofiannan/files/original/37b850ab4593efaa6ffe6398b2e33c1c.PDF,Text,"Internal Memo",1,0
8855,https://ccnydigitalscholarship.org/kofiannan/items/show/8855,"Draft SGB on Protection from Sexual Exploitation and Abuse","1 May 2003","S. Iqbal Riza",,"Protecting United Nations staff from sexual harassment.","Internal memo",,"United States|Switzerland|Austria",English,,"United Nations|UN Archive Collection: OLA Office of Legal Affairs 2003",PDF,UN1244,"United Nations",,Memorandums,,"Austria,Internal memo,Sexual Harassment,Switzerland,United States,Vulnerable women and children",https://ccnydigitalscholarship.org/kofiannan/files/original/b13b50858844fa0ce2db7d131f55e0f2.PDF,Text,"Internal Memo",1,0
8995,https://ccnydigitalscholarship.org/kofiannan/items/show/8995,"Note to the Secretary-General","20 March 2000","S. Iqbal Riza",,"Regarding absences by Senior Officials","Internal memo",,"United States",English,,"United Nations|UN Archive Collection: EOSG - General 2000",PDF,UN0635,"United Nations",,Memorandums,,"Internal memo,Secretary-General,Travel,United States",https://ccnydigitalscholarship.org/kofiannan/files/original/3a60d8527c31b9a9518d132c4f939606.PDF,Text,"Internal Memo",1,0
