﻿"Item Id","Item URI","Dublin Core:Title","Dublin Core:Date","Dublin Core:Creator","Dublin Core:Contributor","Dublin Core:Description","Dublin Core:Type","Dublin Core:Subject","Dublin Core:Coverage","Dublin Core:Language","Dublin Core:Relation","Dublin Core:Source","Dublin Core:Format","Dublin Core:Identifier","Dublin Core:Rights","Dublin Core:Publisher","Item Type Metadata:Original Format","PDF Text:Text",tags,file,itemType,collection,public,featured
8196,https://ccnydigitalscholarship.org/kofiannan/items/show/8196,"Authorization Letter","7 December 2006","Kofi Annan",,"This document is an authorization for Mr. Nicolas Michel to sign the agreement between the United Nations and Lebanon on the establishment of a Special Tribunal for Lebanon.","Internal memo",,Lebanon,English,,"United Nations|UN Archive Collection: OLA Office of Legal Affairs 2006 (Jul-Dec)",PDF,UN2281,"United Nations",,Memorandums,,"Internal memo,Lebanon,Special Tribunal",https://ccnydigitalscholarship.org/kofiannan/files/original/ae7001e462f5b5252e4679ae986f2eca.PDF,Text,"Internal Memo",1,0
8224,https://ccnydigitalscholarship.org/kofiannan/items/show/8224,"Documents on an Interim Maritime Task Force in Lebanon","7 September 2006","Kofi Annan|Alicia Bárcena|Jean-Marie Guéhenno",,"This document is a series of notes and letters about an interim maritime task force within Lebanon, per the request of the prime minister of Lebanon. The document includes a note to the foreign ministers in the UK, France, Greece, and Italy and a letter written to them by Kofi Annan, as well as a note to Ms. Alicia Barcena about the letters.","Internal memo",,Lebanon,English|French,,"United Nations|UN Archive Collection: DPKO Department of Peacekeeping Operations - 2006 (Sept - Dec)",PDF,UN2181,"United Nations",,Memorandums,,"Interim Maritime Task Force,Internal memo,Lebanon",https://ccnydigitalscholarship.org/kofiannan/files/original/e937d0945a55755dc0a109bdcdd20a31.PDF,Text,"Internal Memo",1,0
8072,https://ccnydigitalscholarship.org/kofiannan/items/show/8072,"Documents on the Lebanon Conference","1 August 2006","Angela Kane",,"This document is a set of notes and a list of participants as well as a summary of the Conference for Lebanon in Rome.","Internal memo",,Lebanon,English,,"United Nations",PDF,UN2131,"United Nations",,Memorandums,,"Internal memo,Lebanon,Lebanon Conference",https://ccnydigitalscholarship.org/kofiannan/files/original/3f11d258c4e8012307fffedf38d4bb9a.pdf,Text,"Internal Memo",1,0
8898,https://ccnydigitalscholarship.org/kofiannan/items/show/8898,"Guidance for United Nations Humanitarian Agencies and its Implementing Partners on Engaging with Elected Hezbollah Officials or Hizbollah Affiliated Welfare Institutions","25 August 2006","Deputy Secretary-General Marc Mallon Brown",,"Note from Deputy Secretary-General Mark Mallon Brown informing Kemal Dervis (UNDP), Jan Egeland (OCHA), Ibrahim Gambari (DPA), Jean-Marie Guehenno (DPKO), Nicolas Michel, David Veness about the terms of reference and the guidance for United Nations Humanitarian Agencies and its implementing Partners on engaging with Elected Hezbollah Officials of Hezbollah Affiliated Welfare Institutions. Brown insists that cooperation and work with local and national elected Officials in order to implement and assess assistance distribution excluding Hezbollah elements and armed groups or movements.","Internal memo",,"Middle East|Lebanon|Syria",English,,"United Nations|UN Archive Collection: RELIEF OPS/OCHA - 2006 - Office for the Coordination of Humanitarian Affairs/Office of the Emergency Relief Coordinator",PDF,UN2168,"United Nations",,Memorandums,,"Guidance For United Nations Humanitarian Agencies,Hezbollah Affiliated Welfare Institutions,Internal memo,Lebanon,Middle East,Syria",https://ccnydigitalscholarship.org/kofiannan/files/original/f5fb14cb041e4644dbbae455b42e1e8d.PDF,Text,"Internal Memo",1,0
4827,https://ccnydigitalscholarship.org/kofiannan/items/show/4827,"Interview with the Secretary-General and Al Jazeera","1 August 2006","Kofi Annan with Al-Jazeera",,"Transcript of an interview with Secretary-General Kofi Annan by Al-Jazeera discussing the fighting over the Israeli and Lebanon border with Hezbollah. The war has been intensifying.",Interview,"United Nations|United Nations Secretary-General|Annan|Kofi A. (Kofi Atta)|Israel-Hezbollah| conflict over border with Lebanon|George W. Bush|George W. Bush in Lebanon|Hezbollah|UN Security Council|Lebanon and Humanitarian crisis",Lebanon|Israel,English,,"United Nations",PDF,UN9206,"United Nations","Al Jazeera",,," Lebanon,George W. Bush,George W. Bush,Hizballah (Lebanon),Humanitarian Crisis,UN Security Council,Hezbollah,Hizballah (Lebanon),Humanitarian Crisis,Interview,Israel,Israel-Hezbollah,Lebanon,Lebanon and Humanitarian crisis,UN Security Council",https://ccnydigitalscholarship.org/kofiannan/files/original/02ff551488cf80554f8653a9435de58a.pdf,Text,Interviews,1,0
7881,https://ccnydigitalscholarship.org/kofiannan/items/show/7881,"Interview with the Secretary-General by Larry King on CNN's Larry King Live","21 July 2006","Kofi Annan with Larry King of CNN",,"Invitation letter to Stephane Dujarric, Spokesman for the Secretary-General, and the transcript of an interview with Secretary-General Kofi Annan by Larry King on his TV show Larry King Live. They are speaking about the war going on over the border between Lebanon and Israel in response to attacks by Hezbollah and Israel.",Interview,"United Nations|United Nations Secretary-General|Annan|Kofi A. (Kofi Atta)|Israel-Hezbollah| conflict over border with Lebanon|Rice|Condoleezza|Hezbollah|Syria|Iran",Lebanon,English,,"United Nations",PDF,UN9205,"United Nations",CNN,,," Lebanon,Condoleezza Rice,Hezbollah,Interview,Iran,Israel-Hezbollah,Lebanon,Syria",https://ccnydigitalscholarship.org/kofiannan/files/original/f0d8efef138643ee0b9d8c134ea7aae2.pdf,Text,Interviews,1,0
7880,https://ccnydigitalscholarship.org/kofiannan/items/show/7880,"Interview with the Secretary-General by Talal Al-Haj of Al Arabiya TV","24 February 2005","Kofi Annan with Al Arabiya TV",,"Transcript of an interview with Secretary-General by Talal Al-Haj for Al Arabiya TV. It covers the announcement that Syria plans to withdraw from Lebanon in accordance with the Taif Agreement in compliance with UN Security Council resolution 1559.",Interview,"United Nations|United Nations Secretary-General|Annan|Kofi A. (Kofi Atta)|Lebanon and Withdrawal of Syrian troops|Chirac|Jacques|Terje Rod-Larsen|Israeli-Palestinian conflict|Oil-for-Food Programme|Paul Volcker and Volcker report|Darfur|UN Office for West Africa|Economic Community of West African States (ECOWAS)",Lebanon|Syria|Sudan,English,"UN Security Council Resolution 1559","United Nations",PDF,UN9202,"United Nations",,,,"Darfur,Economic Community Of West African States (ECOWAS),Interview,Israeli-Palestinian Conflict,Jacques Chirac,Lebanon,Lebanon and Withdrawal of Syrian troops,Oil-For-Food Programme,Paul Volcker and Volcker report,Sudan,Syria,Terje Rod-Larsen,UN Office For West Africa",https://ccnydigitalscholarship.org/kofiannan/files/original/19a08adf38b40037e95d1f9c9a12de2a.pdf,Text,Interviews,1,0
7906,https://ccnydigitalscholarship.org/kofiannan/items/show/7906,"Interview with the Secretary-General by the Beijing Review","12 September 2006","Kofi Annan",,"These are written responses by Secretary-General Kofi Annan in response to questions sent by the Beijing Review. Topics covered include Annan's role as Secretary-General and his career and the war over the border in Lebanon. Sent by Stephanie Dujarric, Spokesman for the Secretary General to Gangyi Wang, President of Beijing Review.",Interview,"United Nations|United Nations Secretary-General|Annan|Kofi A. (Kofi Atta)|UN goals and ideals|Collective security|Peacekeeping|Israel-Hezbollah| conflict over border with Lebanon|Human Rights Council|Millennium Development Goals|China|Economic growth in China",Lebanon|Israel|China,English,,"United Nations",PDF,UN9204,"United Nations","Beijing Review",,," Lebanon,China,Collective Security,Economic growth in China,Human Rights Council,Interview,Israel,Israel-Hezbollah,Lebanon,Millennium Development Goals,Peacekeeping,UN goals and ideals",https://ccnydigitalscholarship.org/kofiannan/files/original/1bc4dc0f9bc3e7f4fee4af1d3723efb6.pdf,Text,Interviews,1,0
8174,https://ccnydigitalscholarship.org/kofiannan/items/show/8174,"Lebanon Tribunal","12 July 2006",,,"This is a Note to update on the progress in negotiations aimed at the establishment of a Special Tribunal for pursuant to Secretary Council resolution 1664 (2006).","Internal memo",,"Lebanon|United States",English,,"United Nations",PDF,UN2102,"United Nations",,Memorandums,,"Internal memo,Lebanon,Negotiation,United States",https://ccnydigitalscholarship.org/kofiannan/files/original/224c05daa206b7bf034d3808f751e02b.pdf,Text,"Internal Memo",1,0
8366,https://ccnydigitalscholarship.org/kofiannan/items/show/8366,"Letter from Cherif Bassiouni concerning the imposition of the death penalty for apostasy.","5 April 2006",,,"This is a Note Mr.Michel from Professor Cherif Bassiouni to the Secretary-General concerning the imposition of the death penalty for apostasy.","Internal memo",,Morocco|Tunisia|Algeria|Egypt|Syria|Lebanon|Iraq|Jordan,English,,"United Nations|UN Archive Collection: OLA Office of Legal Affairs 2006 (Jan - June)",PDF,UN2013,"United Nations",,Memorandums,,"Algeria,Death Penalty,Egypt,Internal memo,Iraq,Jordan,Lebanon,Morocco,Syria,Tunisia",https://ccnydigitalscholarship.org/kofiannan/files/original/3631b49fece50b9ceecd0cd96ff6688a.PDF,Text,"Internal Memo",1,0
8833,https://ccnydigitalscholarship.org/kofiannan/items/show/8833,"Letter to Fouad Siniora","24 January 2006",,,"This a Note Regarding the of Killing of former Prime Minister Hariri and others to be tried by a tribunal of an International character.Also mindful of the letter of 13 December 2005 requesting the Security council to establish Such a tribunal.","Internal memo",,Lebanon,English,,"United Nations|UN Archive Collection: OLA Office of Legal Affairs 2006 (Jan - June)",PDF,UN1935,"United Nations",,Memorandums,,"Internal memo,Lebanon,Security Council Resolution",https://ccnydigitalscholarship.org/kofiannan/files/original/0ab5a72a3c07d24da1ecda3515d8219c.PDF,Text,"Internal Memo",1,0
8892,https://ccnydigitalscholarship.org/kofiannan/items/show/8892,"Letter to Gambari, Guehenno, Egeland, Michel and Fawzi","14 August 2006","Alica Barcena",,"Alicia Barcena, Chef de Cabinet informs Gambari, Guehenno, Egeland, Michel and Fawzi about the decisions of UN Secretary-General Kofi Annan to establish with immediate effect, a Special Inter-Departmental Strategy Group on Lebanon and the wider Middle East, based in the Department of Political Affairs and under the leadership Michael Williams, Special Adviser on the Middle East to the UN SG.","Internal memo",,"Middle East|Lebanon",English,,"United Nations|UN Archive Collection: DPA Department of Political Affairs 2006",PDF,UN2154,"United Nations",,Memorandums,,"Egeland,Ibrahim Gambari,Internal memo,Jean-Marie Guéhenno,Lebanon,Michel and Fawzi,Middle East,Special Inter-departmental Strategy Group on Lebanon and the Wider Middle East",https://ccnydigitalscholarship.org/kofiannan/files/original/4bc52a7c8682cd89e7f818cd4fd2f9fd.PDF,Text,"Internal Memo",1,0
8197,https://ccnydigitalscholarship.org/kofiannan/items/show/8197,"Note to Mr Michel: Special Tribunal for Lebanon - Signing of the Agreement","7 December 2006","Mark Malloch Brown",,"This letter is about the special tribunal for Lebanon by Nicolas Michel to Secretary-General Antonio Guterres with a note attached by Mark Malloch Brown to Mr. Michel.|Note: Handwritten Note by Kofi Annan: ""Many thanks. We should follow the normal practice and you as legal counsel should sign for the UN. The venue for signing should be UN HQs or it be signed by the two designees in Beirut and New York respectively""","Internal memo",,Lebanon,English,,"United Nations|UN Archive Collection: OLA Office of Legal Affairs 2006 (Jul-Dec)",PDF,UN2280,"United Nations",,Memorandums,,"Internal memo,Lebanon,Special Tribunal",https://ccnydigitalscholarship.org/kofiannan/files/original/25e4702d4faba30e87fd47f1e1d7015e.PDF,Text,"Internal Memo",1,0
5726,https://ccnydigitalscholarship.org/kofiannan/items/show/5726,"Note to Mr. Guehenno","25 October 2006","Mark Malloch Brown",,"This document is about the situation in Lebanon with regards to the United Nations and their Interim Force (UNIFIL).","Internal memo",,Lebanon,English,,"United Nations|DPKO Department of Peacekeeping Operations - 2006 (Sept - Dec)",PDF,UN2227,"United Nations",,Memorandums,,"Internal memo,Lebanon,UNIFIL",https://ccnydigitalscholarship.org/kofiannan/files/original/deea69794eeb098caf0b60acb8ae58b8.PDF,Text,"Internal Memo",1,0
8096,https://ccnydigitalscholarship.org/kofiannan/items/show/8096,"Note to Mr. Guéhenno from Alicia Bárcena","6 September 2006","Alicia Bárcena",,"This document is a note about the United Nations Interim Force in Lebanon and its deployment in the country.","Internal memo",,Lebanon,English,,"United Nations|UN Archive Collection: DPKO Department of Peacekeeping Operations - 2006 (Sept - Dec)",PDF,UN2180,"United Nations",,Memorandums,,"Internal memo,Lebanon,UNIFIL",https://ccnydigitalscholarship.org/kofiannan/files/original/cf93810039eeeb7947a8b158861786bf.PDF,Text,"Internal Memo",1,0
8912,https://ccnydigitalscholarship.org/kofiannan/items/show/8912,"Note to Mr. Malloch Brown: Fundraising for the Lebanon Flash Appeal","8 August 2006","Jan Egeland",,"Jan Egeland informs Malloch Brown, UNDP Administrator about the UN Secretary-General Kofi Annan's support of the initiative and prepares attached letters addressed to Head of State of Brunei Darussalam and the Heads of States of Gulf Cooperation Council (GCC) member states including Bahrain, Oman, Qatar, Saudi Arabia, United Arab Emirates and Kuwait in which he asks for funding of a UN humanitarian programme in Lebanon.","Internal memo",,Lebanon,English,,"United Nations|UN Archive Collection: RELIEF OPS/OCHA - 2006 - Office for the Coordination of Humanitarian Affairs/Office of the Emergency Relief Coordinator",PDF,UN2140,"United Nations",,Memorandums,,"Internal memo,Lebanon,UN Humanitarian Programme In Lebanon",https://ccnydigitalscholarship.org/kofiannan/files/original/171eb00bbf8f9352a5fae94cb7492900.PDF,Text,"Internal Memo",1,0
8946,https://ccnydigitalscholarship.org/kofiannan/items/show/8946,"Note to Mr. Prendergast: Preparations for Lebanon Investigation Commission","6 May 2005","Micheal Moller",,"Note from the Secretary-General thanking Mr. Prendergast for the appointment of a Commissioner.|Note: Handwritten note by Kofi Annan: ""Many thanks for this memo. We must notice every effort to settle this issue- that is the appointment of the commissioner by 13 May. KA 6/5""","Internal memo",,Lebanon,English,,"United Nations|UN Archive Collection: DPA Department of Political Affairs 2005 (May - Dec)",PDF,UN1709,"United Nations",,Memorandums,,"Internal memo,Investigation Commission,Lebanon",https://ccnydigitalscholarship.org/kofiannan/files/original/e12c55f63188e0f52b642fd1a0e0737c.PDF,Text,"Handwritten Notes",1,0
7989,https://ccnydigitalscholarship.org/kofiannan/items/show/7989,"Note to Mrs. Tallawy and Mr. Guéhenno: Logistic and Administrative Support to UNIIC","13 May 2005","Kieran Prendergast",,"This is a note about the logistics and Administrative arrangements that need to be put in place for the smooth operation of the United Nations International Independent Investigation Commission.","Internal memo",,Lebanon,English,,"United Nations|DPA Department of Political Affairs 2005 (May - Dec)",PDF,UN1715,"United Nations",,Memorandums,,"Internal memo,Lebanon,UNIIC",https://ccnydigitalscholarship.org/kofiannan/files/original/c587c062e52db434dadfdc81a7d3e594.PDF,Text,"Internal Memo",1,0
8881,https://ccnydigitalscholarship.org/kofiannan/items/show/8881,"Note to Ms Alicia Barcena","24 August 2006","Hansjoerg Strohmeyer",,"Hansjoerg Strohmeyer implemented Michael Williams' instructions to prepare a briefing note on the Humanitarian situation in Lebanon and the Middle East in light of the upcoming mission of the UN Secretary-General Kofi Annan in the region.","Internal memo",,"Middle East|Lebanon",English,,"United Nations|UN Archive Collection: RELIEF OPS/OCHA - 2006 - Office for the Coordination of Humanitarian Affairs/Office of the Emergency Relief Coordinator",PDF,UN2166,"United Nations",,Memorandums,,"Alicia Barcena,Chef De Cabinet,Hansjoerg Strohmeyer,Humanitarian Situation,Internal memo,Lebanon,Michael Williams,Middle East",https://ccnydigitalscholarship.org/kofiannan/files/original/24d20990d2ebbfbd8fb815f1ad6e0b84.PDF,Text,"Internal Memo",1,0
6926,https://ccnydigitalscholarship.org/kofiannan/items/show/6926,"Note to Ms. Barcena from Jan Egeland","4 December 2006","Kofi Annan|Jan Egeland",,"This document is a letter from Kofi Annan to Sheikh Khalifa Bin Zayed Al Nahyan, the President of the United Arab Emirates on their help in the crisis in Lebanon, with a note attached from Jan Egeland to Ms. Barcena.","Internal memo",,"United Arab Emirates|Lebanon",English,,"United Nations|RELIEF OPS/OCHA Office for the Coordination of Humanitarian Affairs/Office of the Emergency Relief Coordinator (Sept-Dec) 2005",PDF,UN2273,"United Nations",,Memorandums,,"Internal memo,Lebanon,United Arab Emirates",https://ccnydigitalscholarship.org/kofiannan/files/original/05e7772f474a3319837213ec7693c32c.PDF,Text,"Internal Memo",1,0
8170,https://ccnydigitalscholarship.org/kofiannan/items/show/8170,"Note to the Secretary-General","4 August 2006",,,"This document is about strengthening the DPA'S capacity to provide political advice on the conflict in Lebanon and the Middle East, with regards to certain core components of the task.|Note: Handwritten Note by Kofi Annan: ""Do review and advise urgently. KA""","Internal memo",,Lebanon|Middle East,English,,"United Nations|UN Archive Collection: DPA Department of Political Affairs 2006",PDF,UN2135,"United Nations",,Memorandums,,"Department Of Political Affairs,Department Of Political Affairs (DPA),Internal memo,Lebanon,Middle East",https://ccnydigitalscholarship.org/kofiannan/files/original/abf26dcb9587141b6c5db6d43000122b.PDF,Text,"Internal Memo",1,0
8226,https://ccnydigitalscholarship.org/kofiannan/items/show/8226,"Note to the Secretary-General","14 November 2006","Nicolas Michel",,"This document is about the establishment of the special tribunal for Lebanon. The document references the situation in Lebanon and describes the report that is presenting the tribunal.","Internal memo",,Lebanon,English,,"United Nations|UN Archive Collection: OLA Office of Legal Affairs 2006 (Jul -Dec)",PDF,UN2254,"United Nations",,Memorandums,,"Internal memo,Lebanon,Special Tribunal",https://ccnydigitalscholarship.org/kofiannan/files/original/86d565b95096f4e66cc287333cb3341d.PDF,Text,"Internal Memo",1,0
8233,https://ccnydigitalscholarship.org/kofiannan/items/show/8233,"Note to the Secretary-General","9 November 2006",,,"This document is about a Special Tribunal for Lebanon, especially with regards to past documents and actions on the issue.","Internal memo",,Lebanon,English,,"United Nations|UN Archive Collection: OLA Office of Legal Affairs 2006 (Jul -Dec)",PDF,UN2246,"United Nations",,Memorandums,,"Internal memo,Lebanon,Special Tribunal",https://ccnydigitalscholarship.org/kofiannan/files/original/a271c59525747b98a114338fa377a08f.PDF,Text,"Internal Memo",1,0
8923,https://ccnydigitalscholarship.org/kofiannan/items/show/8923,"Note to the Secretary-General","9 August 2006","Ibrahim Gambari",,"Mr Ibrahim Gambari writes to suggest to the UN Secretary-General Kofi Annan about creating a Committee, within the Department of Political Affairs, for political advice on the evolving situation in Lebanon and on the Middle East composed by Mr Michael Williams, UK (Chair), Ms Lee O'Brien, US, Mr Michael Contet, France, Mr Mark Quarterman, US (legal), Mr Salman Ahmed, US (DPKO), Mr Ghassan Salame, French/Lebanese (Consultant), and other staff from relevant Departments, Funds and Programmes. This Committee would report daily to UN Secretary-General Kofi Annan and the Under-Secretary-General of DPA.","Internal memo",,"Middle East|Lebanon|Israel",English,,"United Nations|UN Archive Collection: DPA Department of Political Affairs 2006",PDF,UN2142,"United Nations",,Memorandums,,"Department Of Political Affairs (DPA),Internal memo,Israel,Lebanon,Middle East,political advice on the conflict in Lebanon and the Middle East",https://ccnydigitalscholarship.org/kofiannan/files/original/cf95dbb0d36368035f50849931f6d581.PDF,Text,"Internal Memo",1,0
