﻿"Item Id","Item URI","Dublin Core:Title","Dublin Core:Date","Dublin Core:Creator","Dublin Core:Contributor","Dublin Core:Description","Dublin Core:Type","Dublin Core:Subject","Dublin Core:Coverage","Dublin Core:Language","Dublin Core:Relation","Dublin Core:Source","Dublin Core:Format","Dublin Core:Identifier","Dublin Core:Rights","Dublin Core:Publisher","Item Type Metadata:Original Format","PDF Text:Text",tags,file,itemType,collection,public,featured
4988,https://ccnydigitalscholarship.org/kofiannan/items/show/4988,"UNAMSIL: Letter to the President of the Security Council","15 November 1999","Executive Office of the UN Secretary-General|Under-Secretary-General for Peacekeeping Bernard Miyet",,"Note from Bernard Miyet, Under-Secretary-General for Peacekeeping, to S. Iqbal Riza, Chef de Cabinet to Secretary-General Kofi Annan, regarding the appointment of Mr. Adeniji as the Secretary-General's Special Representative for Sierra Leone.","Internal memo",,Sierra Leone,English,,"United Nations",PDF,UN0577,"United Nations",,Memorandums,,"Bernard Miyet,Internal memo,Oluyemi Adeniji,S. Iqbal Riza,Sierra Leone,UN Mission In Sierra Leone (UNAMSIL)",https://ccnydigitalscholarship.org/kofiannan/files/original/4f9aa3be8d0d96c89a1be8c25bdbce3b.pdf,Text,"Internal Memo",1,0
7503,https://ccnydigitalscholarship.org/kofiannan/items/show/7503,"Sierra Leone Needs Help to Break Cycle of Violence","10 October 1999","Kofi Annan",,"Op-ed by Secretary-General Kofi Annan in The Deseret News (Salt Lake City) on Sierra Leone, and especially on its relation to the world, and how it needs help in solving violence.",Op-Ed,,"Sierra Leone",English,,"United Nations",,UN2414,"United Nations","The Deseret News",Documents,,"Op-Ed,Sierra Leone",https://ccnydigitalscholarship.org/kofiannan/files/original/5e50df262f6e078bf6f340b9984f6f31.pdf,Text,OP-ED,1,0
5175,https://ccnydigitalscholarship.org/kofiannan/items/show/5175,"Sierra Leone - Information to the Media","18 May 2000","S. Iqbal Riza",,"Secretary-General Kofi Annan, requested to instruct UNAMSIL to have a military officer as an associate spokesman with Mr. Wimhurst to give briefings on military questions in Sierra Leone due to the military aspect in Sierra Leone.","Internal memo",,,English,,"United Nations|DPI 2000",PDF,UN0668,"United Nations",,Memorandums,,"DKPO,Internal memo,Military Officer,Sierra Leone,UNAMSIL",https://ccnydigitalscholarship.org/kofiannan/files/original/231ee5a2e07f17fb7af31ae4922d9e16.PDF,Text,"Internal Memo",1,0
8314,https://ccnydigitalscholarship.org/kofiannan/items/show/8314,"Sierra Leone","14 July 2005","Executive Office of the UN Secretary-General",,"This is a letter regarding the special court in Sierra Leone.","Internal memo",,Sierra Leone,English,,"United Nations|UN Archive Collection: EOSG 2005 Executive Office of the Secretary General",PDF,UN1775,"United Nations",,Memorandums,,"Executive Office Of The Secretary-General (EOSG),Internal memo,Resolution 1315 (Special Court For Sierra Leone),Sierra Leone",https://ccnydigitalscholarship.org/kofiannan/files/original/ac65572dbd88b3fe1f2c697669c615fb.PDF,Text,"Internal Memo",1,0
4722,https://ccnydigitalscholarship.org/kofiannan/items/show/4722,"Secretary-General Visits Sierra Leone Secretary-General Visits Sierra Leone","03 December 2000",,,"Secretary-General Kofi Annan (centre) inspecting UNAMSIL's Nigerian Battalion honour guard of UNAMSIL at Port Loko.",Photographs,,"Port Loko|Sierra Leone",,,"United Nations, UN Photo/Eskinder Debebe",JPEG,ANNANPHOTO0008,"United Nations",,Photograph,,"Photograph,Port Loko,Sierra Leone",https://ccnydigitalscholarship.org/kofiannan/files/original/25253c908020f5da6624330240dfd5cd.jpg,"Still Image",Photographs,1,0
4728,https://ccnydigitalscholarship.org/kofiannan/items/show/4728,"Secretary-General Visits Sierra Leone","03 December 2000",,,"The Paramount Chief of the Northern Region (right) awarded honorary Chieftancy titles upon Secretary-General Kofi Annan and Mrs. Nane Annan.",Photographs,,"Port Loko|Sierra Leone",,,"United Nations, UN Photo/Eskinder Debebe",JPEG,ANNANPHOTO0009,"United Nations",,Photograph,,"Photograph,Port Loko,Sierra Leone",https://ccnydigitalscholarship.org/kofiannan/files/original/575fa0f586b3c05e4a811c15a512e319.jpg,"Still Image",Photographs,1,0
4708,https://ccnydigitalscholarship.org/kofiannan/items/show/4708,"Secretary-General Visits Sierra Leone","01 December 2000",,,"Secretary-General Kofi Annan (seated right), en route to Sierra Leone, meeting with his senior staff on the plane.",Photographs,,"Sierra Leone",,,"United Nations, UN Photo/Eskinder Debebe",JPEG,ANNANPHOTO0007,"United Nations",,Photograph,,"Photograph,Sierra Leone",https://ccnydigitalscholarship.org/kofiannan/files/original/7917703dc94351657d24df9c00780758.jpg,"Still Image",Photographs,1,0
8980,https://ccnydigitalscholarship.org/kofiannan/items/show/8980,"Note to the Secretary-General: Report of the Secretary-General on Africa Requested by the Security Council at its Ministerial Meeting Held on 25 September 1997","9 October 1997","Binta Dieye",,"Note from Binta Dieye to Secretary-General Kofi Annan regarding the contents and strategy of the report of the Secretary-General on Africa.","Internal memo",,"Zimbabwe|Nigeria|Guyana|Cameroon|Senegal|Ghana|Burkina Faso|Sierra Leone",English,,"United Nations|UN Archive Collection: Security Council Matters - General 1997 (October-December)",PDF,UN0115,"United Nations",,Memorandums,,"Africa,African Unity Summit,Alioune Sene,Annual meeting,Bertram Collins,Burkina Faso,Cameroon,Economic Commission For Africa (ECA),Georges Ngango,Ghana,Guyana,Ibrahima Fall,Internal memo,Nelson-Richards Melsome,Nigeria,OAU,Panel Of High-Level Personalities On African Development,Patrick Hayford,Pierre Claver Darnib,Senegal,Sierra Leone,Special Coordinator For Africa (OSCAL),Teniola O. Apara,UN Economic Commission For Africa,World Bank,Zimbabwe",https://ccnydigitalscholarship.org/kofiannan/files/original/453c3d489d066a658eb389be3e519d5e.pdf,Text,"Internal Memo",1,0
8613,https://ccnydigitalscholarship.org/kofiannan/items/show/8613,"Note to the Secretary-General: Preparation of the 15th report to the Security Council on UNAMSIL","2 August 2002","Jean-Marie Guéhenno",,"This is a note to Kofi Annan from Jean-Marie Guehenno outlining the 15th report to the Security Council regarding UNAMSIL and the drawdown of military forces currently with the mission. The report planned out how this drawdown would take place.|Note: Handwritten note by Kofi Annan: ""Approved. KA""","Internal memo",,Sierra Leone,English,,"United Nations|UN Archive Collection: DPKO Department of Peacekeeping Operations 2002",PDF,UN1105,"United Nations",,Memorandums,,"Internal memo,Jean-Marie Guéhenno,Sierra Leone,UN Mission In Sierra Leone (UNAMSIL)",https://ccnydigitalscholarship.org/kofiannan/files/original/b5522422bf2b39d5b87915c560bdb60f.PDF,Text,"Internal Memo",1,0
8672,https://ccnydigitalscholarship.org/kofiannan/items/show/8672,"Note to the Secretary-General: Guinea-Liberia-Sierra Leone Border Problems- The role of the United Nations","27 September 2000","Patrick Hayford",,"Internal note prepared by Patrick Hayford of political affairs regarding the Guinea-Liberia-Sierra Leone Border Problems. Another note from Hayford follows. Included is a handwritten note by Kofi Annan.|Note: Handwritten note by Kofi Annan: ""Noted. Thanks. Seek views of DPA. Aren't there too many groups? They will soon be tripping over each other. -K.A., 25/9""","Internal memo",,Nigeria|Guinea|Liberia|Sierra Leone|Mali,English,,"United Nations|UN Archive Collection: EOSG - General 2000",PDF,UN0748,"United Nations",,Memorandums,,"Ahmad Tejan Kabbah,Alpha Oumar KONARE,Department Of Peacekeeping Operations (DPKO),Economic Community Of West African States (ECOWAS),Guinea,Guinea-Bissau and Abuja Agreement,Internal memo,Liberia,Lomé Peace Agreement,Mali,Mano River Union,Nigeria,Sierra Leone,Søren Jessen-Petersen,UN High Commissioner For Refugees (UNHCR)",https://ccnydigitalscholarship.org/kofiannan/files/original/0427336e323b603f7c18cbd01e7b670f.PDF,Text,"Internal Memo",1,0
8533,https://ccnydigitalscholarship.org/kofiannan/items/show/8533,"Note to the Secretary-General: Guinea Refugee Situation","13 February 2001","Patrick Hayford",,"Internal note from Patrick Hayford, the Director of the United Nations Office of the Special Adviser on Africa, to Kofi Annan regarding the refugee situation in Guinea.|Note: Handwritten note by Kofi Annan ""Noted, even though I mentioned it [to] some of them and sought their support. -K.A., 14/2""","Internal memo",,Guinea|Liberia|Sierra Leone,English,,"United Nations|UN Archive Collection: EOSG 2001 Executive Office of the Secretary General",PDF,UN0820,"United Nations",,Memorandums,,"Economic Community Of West African States (ECOWAS),Guinea,Internal memo,Liberia,Ruud Lubbers,Sierra Leone",https://ccnydigitalscholarship.org/kofiannan/files/original/94b363d091ebde02973c85bb8b2a1b64.pdf,Text,"Internal Memo",1,0
9118,https://ccnydigitalscholarship.org/kofiannan/items/show/9118,"Note to the Secretary-General through Mr. Mark Malloch Brown","5 August 2005",,,"Note to the Secretary-General through Mr. Mark Malloch Brown regarding Special Court for Sierra Leone.","Internal memo",,Sierra Leone,English,,"United Nations|OLA Office of Legal Affairs 2004",PDF,UN1802,"United Nations",,Memorandums,,"Internal memo,Sierra Leone,Special Court For Sierra Leone,UN Secretary-General",https://ccnydigitalscholarship.org/kofiannan/files/original/c42d59862e1f5e424ca351a5a6880809.PDF,Text,"Internal Memo",1,0
6054,https://ccnydigitalscholarship.org/kofiannan/items/show/6054,"Note to the Secretary-General regarding the Special Court for Sierra Leone","25 May 2001",,,"A group of interested states met on May 22 was convened by Canada to convey to the Secretariat a joint position on their approach to the establishment of the Special Court for Sierra Leone.","Internal memo",,,English,,"United Nations|OLA - Office of Legal Affairs (Jan-June) 2001",PDF,UN0874,"United Nations",,Memorandums,,"Hans Corell,Internal memo,Sierra Leone,Special Court For Sierra Leone",https://ccnydigitalscholarship.org/kofiannan/files/original/c81c321b50c76e8ccff1a51c521a5f3e.pdf,Text,"Internal Memo",1,0
6825,https://ccnydigitalscholarship.org/kofiannan/items/show/6825,"Note to the Secretary-General regarding the proposal for using sports to help several groups","4 May 2001",,,"A proposal to use sports to work with six distinct groups: combatants who live in proximity to UNAMSIL deployment areas, ex-combatants who have disarmed, non-combatant, youth in school, handicapped, and psychologically traumatized.","Internal memo",,Sierra Leone,English,,"United Nations|EOSG 2002 Executive Office of the Secretary General",PDF,UN0863,"United Nations",,Memorandums,,"Department Of Peacekeeping Operations (DPKO),Internal memo,Sierra Leone,Sports and peace,UN Children's Fund (UNICEF),UN Mission In Sierra Leone (UNAMSIL)",https://ccnydigitalscholarship.org/kofiannan/files/original/e1fbe78e324b6903ec9e6da913811b31.pdf,Text,"Internal Memo",1,0
8404,https://ccnydigitalscholarship.org/kofiannan/items/show/8404,"Note to the Secretary-General on the Special Court for Sierra Leone","10 March 2004",,,"Note to the Secretary-General on the Special Court for Sierra Leone|Note: Handwritten note by Kofi Annan: ""I am pleased that the Council has endorsed the proposal KA 13/3""","Internal memo",,Sierra Leone,English,,"United Nations|UN Archive Collection: OLA Office of Legal Affairs 2004 (Jan - Sept)",PDF,UN1408,"United Nations",,Memorandums,,"Internal memo,Office Of Legal Affairs (OLA),Sierra Leone,UN Security Council and Special Court for Sierra Leone",https://ccnydigitalscholarship.org/kofiannan/files/original/a0eec16b109c3fe6ad07a44748180b91.PDF,Text,"Internal Memo",1,0
8594,https://ccnydigitalscholarship.org/kofiannan/items/show/8594,"Note to the Secretary-General","16 November 2001","Hans Corell, Under-Secretary-General for Legal Affairs",,"Hans Corell, informed Kofi Annan about what was talked about during the informal consultation of the Security Council on 8 November 2001 on the Special Court for Sierra Leone.|Note: Handwritten note by Kofi Annan: ""See page 2 and arrange the meeing suggested by Mr. Corell, KAA 20/11.""","Internal memo",,,English,,"United Nations|UN Archive Collection: OLA Office of Legal Affairs (Oct-Dec) 2001",PDF,UN0998,"United Nations",,Memorandums,,"Government,Internal memo,Operations,Secretariat,Security Council,Sierra Leone,Special Court",https://ccnydigitalscholarship.org/kofiannan/files/original/73438a5ee876bc71665fba5b2bbfba63.PDF,Text,"Internal Memo",1,0
8728,https://ccnydigitalscholarship.org/kofiannan/items/show/8728,"Note to the Deputy Secretary-General","2 June 2000","S. Iqbal Riza",,"A brief letter to Deputy Secretary-General, informing to develop a policy position for the UN on the Lome Agreement viability in the new situation in Sierra Leone.","Internal memo",,Sierra Leone,English,,"United Nations|UN Archive Collection: DPKO Department of Peacekeeping Operations 2000 (Jan-Aug)",PDF,UN0678,"United Nations",,Memorandums,,"Department Of Peacekeeping Operations (DPKO),Internal memo,Lomé Peace Agreement,Office Of Legal Affairs (OLA),S. Iqbal Riza,Sierra Leone,United Nations",https://ccnydigitalscholarship.org/kofiannan/files/original/76d2d5e23b770ba6f12d827fd3310b6b.PDF,Text,"Internal Memo",1,0
4994,https://ccnydigitalscholarship.org/kofiannan/items/show/4994,"Note to Secretary-General The Special Court for Sierra Leone","4 May 2001",,,"A letter to the Secretary-General examining the 60 day period of the appeal for funds for the Special Court of Sierra Leone. Two main issues are under consideration in the group of Interested States: terms of reference of a Management Committee for the Special Court, and the size of the budget.","Internal memo",,Sierra Leone,English,,"United Nations|OLA Office of Legal Affairs (Jan-June) 2001",PDF,UN0862,"United Nations",,Memorandums,,"Internal memo,Office Of Legal Affairs (OLA),Sierra Leone,Special Court For Sierra Leone",https://ccnydigitalscholarship.org/kofiannan/files/original/e000e15afb6aa0b0b1c01b668c12a5fb.pdf,Text,"Internal Memo",1,0
8212,https://ccnydigitalscholarship.org/kofiannan/items/show/8212,"Note to S. Iqbal Riza: UN Inter-Agency Mission to West Africa/Note to the Secretary-General: UN Multi-Disciplinary Mission to West Africa","30 January 2001","Ibrahima Fall",,"Note from Ibrahima Fall to S. Iqbal Riza inform about the absence of a number of ECOWAS Foreign Ministers due to New York meetings and the Organization of African Union scheduled conferences in Libya. Prendergast reports his contact with Fall to the UN Secretary-General Kofi Annan about the UN Mission Multi-Disciplinary Mission to West Africa to Togo, Nigeria, Mali, Senegal, Gambia, Guinea, Sierra Leone, Liberia, Ghana and Cote d'Ivoire. Includes Report to the Security Council on the Prevention of Armed Conflict.|Note: Handwritten note by Kofi Annan: ""Approved. KA""","Internal memo",,"Togo|Nigeria|Mali|Senegal|Gambia|Guinea|Sierra Leone|Liberia|Ghana|Côte d'Ivoire",English,,"United Nations|UN Archive Collection: DPA Department of Political Affairs (Jan - June) 2001",PDF,UN0804,"United Nations",,Memorandums|Reports,,"Côte d'Ivoire,Gambia,Ghana,Guinea,Ibrahima Fall,Internal memo,Kieran Prendergast,Liberia,Mali,Nigeria,Peace,Security UN Multi-Disciplinary Mission To West Africa,Senegal,Sierra Leone,Togo",https://ccnydigitalscholarship.org/kofiannan/files/original/df9a36dbe64e6b377648986bba31dcdd.pdf,Text,"Internal Memo",1,0
8741,https://ccnydigitalscholarship.org/kofiannan/items/show/8741,"Note to S. Iqbal Riza","4 January 2000","Thérèse Gastaut, Office-in-Charge, Department of Public Information",,"Note from Thérèse Gastaut, Officer-in-Charge, Department of Public Information, to S. Iqbal Riza, Chef de Cabinet of Secretary-General Kofi Annan, about the publicity coverage on Africa by UNTV. This article covers the journalists and the types of interviews/press coverage that will be included.","Internal memo",,Sierra Leone|South Africa,English,,"United Nations|UN Archive Collection: DPI 2000",PDF,UN0605,"United Nations",,Memorandums,,"Department Of Public Information (DPI),Internal memo,Sierra Leone,South Africa",https://ccnydigitalscholarship.org/kofiannan/files/original/a07e51c8db40cdfb7148227fcc495f24.PDF,Text,"Internal Memo",1,0
8948,https://ccnydigitalscholarship.org/kofiannan/items/show/8948,"Note to Mr Malloch Brown","10 March 2005","Jean-Marie Guéhenno",,"Note regarding letters sent by the Secretary-General to donor countries appealing for assistance to the Government of Sierra Leone to enhance the functional capacity of the Republic of Sierra Leone Armed Forces.","Internal memo",,,English,,"United Nations|UN Archive Collection: DPKO Department of Peacekeeping Operations - 2005 (Jan -Aug)",PDF,UN1660,"United Nations",,Memorandums,,"Armed Forces,Internal memo,Sierra Leone,UNAMSIL",https://ccnydigitalscholarship.org/kofiannan/files/original/cc944ec485de9889a3978b4ca7c5f9f0.PDF,Text,"Internal Memo",1,0
8511,https://ccnydigitalscholarship.org/kofiannan/items/show/8511,"Note Regarding Security Council Mission to West Africa","12 April 2004","S. Iqbal Riza",,"Note Regarding Security Council Mission to West Africa asking to postpone Security Council retreat from 5-6 June to 25-26 June.|Note: Handwritten note by Kofi Annan: ""Agreed and signed""","Internal memo",,"Liberia|Sierra Leone|Guinea-Bissau|United Kingdom",English,,"United Nations|UN Archive Collection: DPA- Security Council Matters - General 2004 (Jan - Sept)",PDF,UN1427,"United Nations",,Memorandums,,"African Union,Guinea-Bissau,Internal memo,Liberia,Sierra Leone,UN Office In West Africa,UN Security Council and West Africa,United Kingdom,West Africa",https://ccnydigitalscholarship.org/kofiannan/files/original/ee0943d191cd15354244e9dd4750e10e.PDF,Text,"Internal Memo",1,0
8463,https://ccnydigitalscholarship.org/kofiannan/items/show/8463,"Note on the Funding of the Special Court for Sierra Leone","8 December 2003",,,"Note on the Funding of the Special Court for Sierra Leone|Note: Handwritten note by Kofi Annan: ""I approve the recommendation formulated in paragraph 9 above and I had instructed that we write to HOS and court allerting them to the financial difficulties of the Yugoslavia and Rwanda tribunals, I trust these letters have been dispatched. KA 6/12""","Internal memo",,Sierra Leone,English,,"United Nations|UN Archive Collection: OLA Office of Legal Affairs 2003",PDF,UN1350,"United Nations",,Memorandums,,"Internal memo,Sierra Leone,Special Court For Sierra Leone,UN Mission In Sierra Leone (UNAMSIL)",https://ccnydigitalscholarship.org/kofiannan/files/original/c0f513d274c52a96f91d9405a0c1dcd7.PDF,Text,"Internal Memo",1,0
8628,https://ccnydigitalscholarship.org/kofiannan/items/show/8628,"Note for Briefing the Secretary-General and the Security Council on Preliminary Findings and Recommendations of the Inter-Agency Mission to West Africa","12 April 2001","Fall, Ibrahima",,"Excerpts taken from an internal note prepared by Ibrahima Fall, Assistant Secretary-General in the Department of Political Affairs. Included is a handwritten note by the Secretary-General to Deputy Secretary-General Louise Frechette.|Note: Handwritten note by Kofi Annan: ""LF (Louise Frechette), May I ask you to lead on this? It would (be) beneficial bringing all the stakeholders together to review and work out implementation. -K.A., 16/4""","Internal memo",,"West Africa|Senegal|Nigeria|Togo|Liberia|Côte d'Ivoire|Ghana|Sierra Leone|Guinea|Guinea-Bissau|Gambia",English,,"United Nations|UN Archive Collection: DPA Department of Politiral Affairs 2001 (Jan-June)",PDF,UN0856,"United Nations",,Memorandums,,"Africa,African Development Bank,African Union and Capacity building,Bretton Woods Institutions,Child Soldiers,Côte d'Ivoire,Department Of Political Affairs (DPA),Development Funding,Disarmament, Demobilization and Reintegration (DDR),Economic and Social Council (ECOSOC),Economic Commission For Africa (ECA),Economic Community Of West African States (ECOWAS),Gambia,Ghana,Guinea,Guinea-Bissau,Heavily Indebted Poor Countries (HIPC) Program,HIV/AIDS,Human Rights,Internal memo,Internally Displaced Persons (IDPs),Liberia,Mano River Union,Nigeria,Poverty In Africa,Senegal,Sharia Law,Sierra Leone,Togo,West Africa,West African Central Bank,West African Economic and Monetary Union",https://ccnydigitalscholarship.org/kofiannan/files/original/c184f2ffc797f24766d3ed90c9a740fc.pdf,Text,"Internal Memo",1,0
