﻿"Item Id","Item URI","Dublin Core:Title","Dublin Core:Date","Dublin Core:Creator","Dublin Core:Contributor","Dublin Core:Description","Dublin Core:Type","Dublin Core:Subject","Dublin Core:Coverage","Dublin Core:Language","Dublin Core:Relation","Dublin Core:Source","Dublin Core:Format","Dublin Core:Identifier","Dublin Core:Rights","Dublin Core:Publisher","Item Type Metadata:Original Format","PDF Text:Text",tags,file,itemType,collection,public,featured
8918,https://ccnydigitalscholarship.org/kofiannan/items/show/8918,"Proceedings of the Security Council","8 August 2006","Shola Omoregie, Officer-in-Charge, reviewed by Norma Chan",,"Shola Omoregie, Officer-in-Charge, in the Security Council Affairs (DPA) reports to Alicia Barcena, Chef de Cabinet of the UN Secretary-General Kofi Annan on activities the Security Council, 8 August 2006, under its 5508th meeting about the crisis between Lebanon and Israel and the humanitarian conditions in which Heads of the the Arab League Member states and Heads of States of Gulf Cooperation Council (GCC) regret delayed actions for food support to civilians and displaced citizens.","Internal memo",,"Middle East|Lebanon|Israel",English,,"United Nations|UN Archive Collection: DPA SECCO Reports and Activities 2006 (Aug - Dec)",PDF,UN2141,"United Nations",,Memorandums,,"Alicia Barcena,Internal memo,Israel,Lebanon,Lebanon and Israel,Middle East",https://ccnydigitalscholarship.org/kofiannan/files/original/0c27834686e9842504c42c3a62e226ed.PDF,Text,"Internal Memo",1,0
8147,https://ccnydigitalscholarship.org/kofiannan/items/show/8147,"Proceedings of the Security Council: The Situation in the Middle East, including the Palestinian Question","21 July 2006","Linda Perkin, Director, Security Counci Affirs Division|Executive Office of the UN Secretary-General",,"This is a note about the 5493rd (resumed) meeting (s/5493), participation were briefed by Vijay Nambiar, special Advisor to the Secretary-General, and Jan Egeland, USG for Humanitarian Affairs and Emergency relief Coordinator.","Internal memo",,Middle East|Palestine,English,,"United Nations|UN Archive Collection: DPA SECCO Reports and Activities 2006 (Jan-July)",PDF,UN2112,"United Nations",,Memorandums,,"Internal memo,Meetings,Middle East,Palestine",https://ccnydigitalscholarship.org/kofiannan/files/original/91996f3159ed110e5e5b68be1cc95b17.PDF,Text,"Internal Memo",1,0
8662,https://ccnydigitalscholarship.org/kofiannan/items/show/8662,"PROCEEDINGS OF THE SECURITY COUNCIL: The Situation in the Middle East, including the Palestinian Question","22 April 2002","Joseph Stephanides",,"This is a letter written to S. Iqbal Riza by Joseph Stephanides, Director of the Security Council Affairs Division, DPA, attaching notes on the meeting of the Security Council concerning the situation in the Middle East (18-19 April 2002), to be given to Kofi Annan","Internal memo",,Middle East|Palestine,English,,"United Nations|UN Archive Collection: DPA SECCO Reports and Activities 2002 (April-Dec)",PDF,UN1063,"United Nations",,Memorandums,,"Internal memo,Middle East,Middle East peace process and Israeli-Palestine conflict,Palestine",https://ccnydigitalscholarship.org/kofiannan/files/original/da9cb7891c1a719a0675a4e13eb54dc0.PDF,Text,"Internal Memo",1,0
7891,https://ccnydigitalscholarship.org/kofiannan/items/show/7891,"Q & A with Secretary-General for the BBC World Service following a lecture Annan gave at the UN Headquarters","10 December 2002","Kofi Annan with BBC World Service",,"Transcript of Q & A with Secretary-General Kofi Annan and various for the BBC World Service at the UN Headquarters in New York after Annan gave a lecture on 10 December 2002. Annan talks about the UN's relationship to the media.",Interview,"United Nations|United Nations Secretary-General|Annan|Kofi A. (Kofi Atta)|Media|Tolerance|Freedom|Justice|Equal rights|Africa|Peace in Iraq|HIV/AIDS|UN Special Commission on Iraq (UNSCOM)|El Baradei|Mohamed|Hans Blix|Middle East|Africa|Sustainable Development|Colin Powell",Africa|Iraq,English,,"United Nations",PDF,UN9194,"United Nations","BBC World Service",,,"Africa,Colin Powell,Equal Rights,Freedom,Hans Blix,HIV/AIDS,Interview,Iraq,Justice,Media,Middle East,Mohamed El Baradei,Peace In Iraq,Sustainable Development,Tolerance,UN Special Commission on Iraq (UNSCOM)",https://ccnydigitalscholarship.org/kofiannan/files/original/6c46a28e70aa74a44350fafdac16fb02.pdf,Text,Interviews,1,0
8498,https://ccnydigitalscholarship.org/kofiannan/items/show/8498,"Request for Report of the Secretary-General on the Establishment of a Nuclear-Weapon-Free Zone in the Region of the Middle East","9 July 2003","Nobayasu Abe",,"Request Report of the Secretary-General on the Establishment of a Nuclear-Weapon-Free Zone in the Region of the Middle East","Internal memo",,,English,,"United Nations|UN Archive Collection: Disarmament 2003 - General",PDF,UN1261,"United Nations",,Memorandums,,"Disarmament,Internal memo,Middle East,Nuclear Nonproliferation",https://ccnydigitalscholarship.org/kofiannan/files/original/4bbb958625416ef24a0c1c0de81f505e.PDF,Text,"Internal Memo",1,0
5324,https://ccnydigitalscholarship.org/kofiannan/items/show/5324,"Responses by the Secretary-General to the Riyadh Daily","9 August 1999","Kofi Annan",,"Responses by Secretary-General Kofi Annan to questions posed by the Riyadh Daily.","Internal memo|Interview",,"North Korea|Israel|Yugoslavia|Middle East",English,,"United Nations",PDF,UN0517,"United Nations",,Memorandums,,"Internal memo,International Criminal Tribunal For The Former Yugoslavia (ICTY),Interview,Israel,Jammu,Kashmir,Kosovo,Lockerbie Bombing,Middle East,North Korea,Reform Of The Security Council,Yugoslavia",https://ccnydigitalscholarship.org/kofiannan/files/original/95ed62b6abbe0e18f04adad3354eb91d.pdf,Text,"Internal Memo",1,0
7887,https://ccnydigitalscholarship.org/kofiannan/items/show/7887,"Secretary-General Says We Will Not Defeat Terrorism Without Working Together","8 October 2001","Kofi Annan and Al-Hayat",,"Unofficial transcript of an interview with Secretary-General Kofi Annan by international daily Al-Hayat in which they discuss the terrorist attacks on September 11, 2001, the tension between the concepts of terrorism and resistance against occupation, and Annan addresses the suspected involvement of Osama Bin Laden, and Al-Qaeda who may be the alleged planners of the attacks.",Interview,"United Nations|United Nations Secretary-General|Annan|Kofi A. (Kofi Atta)|International terrorism|United States|Sharon|Ariel|Security Council resolution 1373|Osama Bin Laden|Al-Qaida|Afghanistan|Israeli-Palestinian conflict","Middle East|Iraq|Afghanistan|United States",English,,"United Nations",PDF,UN9190,"United Nations",Al-Hayat,,,"Afghanistan,Al-Qaida,Ariel Sharon,International Terrorism,Interview,Iraq,Israeli-Palestinian Conflict,Middle East,Osama bin Laden,Security Council Resolution 1373,United States",https://ccnydigitalscholarship.org/kofiannan/files/original/5c6316ff9e5ab70d759a839ae8b4acad.pdf,Text,Interviews,1,0
7187,https://ccnydigitalscholarship.org/kofiannan/items/show/7187,"Two documents: Secretary-General's meetings with Government Representations from the Middle East and a attached memo regarding a meeting with the US State Department to discuss US dues to the UN","20 September 1999","Executive Office of the UN Secretary-General|Kieran Prendergast|Joseph E. Connor",,"Note from Kieran Prendergast, Under-Secretary-General for Political Affairs, to S. Iqbal Riza regarding inviting Terje Roed-Larsen to attend a meeting with ministers from the Middle East and North Africa. There is also an attached inter-office memorandum regarding a meeting with the Deputy Chief of Staff to the President, Steve Ricchetti, arrnaged by the State Department on the payment of US dues to the UN.","Internal memo",,"Middle East|North Africa",English,,"United Nations",PDF,UN0538,"United Nations",,Memorandums,,"Internal memo,Kieran Prendergast,Middle East,Middle East and Peace process,North Africa,S. Iqbal Riza,Terje Rod-Larsen,UN Dues",https://ccnydigitalscholarship.org/kofiannan/files/original/4a306a0b74ec8dd316477e64f2328d53.pdf,Text,"Internal Memo",1,0
