﻿"Item Id","Item URI","Dublin Core:Title","Dublin Core:Date","Dublin Core:Creator","Dublin Core:Contributor","Dublin Core:Description","Dublin Core:Type","Dublin Core:Subject","Dublin Core:Coverage","Dublin Core:Language","Dublin Core:Relation","Dublin Core:Source","Dublin Core:Format","Dublin Core:Identifier","Dublin Core:Rights","Dublin Core:Publisher","Item Type Metadata:Original Format","PDF Text:Text",tags,file,itemType,collection,public,featured
8442,https://ccnydigitalscholarship.org/kofiannan/items/show/8442,"Note to Mr. Malloch Brown","23 February 2005","Jean-Marie Guéhenno",,"This is a report discussing recommendations to the Security Council concerning mechanisms and activities that could be introduced to facilitate inter-mission cooperation and cross-border operations between the three United Nations peacekeeping ,missions in West Africa.|Note: I really do not feel altogether to admire the S.G. on this. Please propose a solution to either SG and myself or any controversial issues you believe are here|or a solution entering were is normally of concern here. MMB [Mark Malloch Brown]|Note(attached)|Report approved","Internal memo",,Africa,English,,"United Nations|UN Archive Collection: DPKO Department of Peacekeeping Operations - 2005 (Jan -Aug)",PDF,UN1644,"United Nations",,Memorandums,,"Africa,Cross-border operations,Inter-mission cooperation,Internal memo,West Africa",https://ccnydigitalscholarship.org/kofiannan/files/original/ef16ae51bfb4b07acd1b48d96b9a184c.PDF,Text,"Internal Memo",1,0
8435,https://ccnydigitalscholarship.org/kofiannan/items/show/8435,"Establishment of Ethics Office: Interim Arrangements","16 January 2006","Kofi Annan",,"This is a note to Mr. Burnham according the General Assembly approved the establishment of a UN Ethics Office.","Internal memo",,Africa,English,,"United Nations|UN Archive Collection: DM Dept of Management 2006",PDF,UN1927,"United Nations",,Memorandums,,"Africa,Christopher B. Burnham,Interim Arrangement,Internal memo",https://ccnydigitalscholarship.org/kofiannan/files/original/cb63a07cf576f8effc0f1ec06ead1309.PDF,Text,"Internal Memo",1,0
8426,https://ccnydigitalscholarship.org/kofiannan/items/show/8426,"Note to Secretary-General through S. Iqbal Riza","19 January 2004","Ibrahim A. Gambari",,"Terms of reference and composition of the advisory panel","Internal memo",,Africa,English,,"United Nations|UN Archive Collection: DPA Department of Political Affairs 2004 (Jan- Sept)",PDF,UN1369,"United Nations",,Memorandums,,"Africa,Internal memo,NEPAD,S. Iqbal Riza,UN Secretary-General",https://ccnydigitalscholarship.org/kofiannan/files/original/836b0738272649d9ed68ad1fc2aea624.PDF,Text,"Internal Memo",1,0
8400,https://ccnydigitalscholarship.org/kofiannan/items/show/8400,"Conference on Disarmament, Demobilization, Reintegration (DDR) and Stability in Africa, Freetown, Sierra Leone, 21-23 June, 2005","7 June 2005",,,"This is a memo about the conference on Disarmament, Demobilization, Reintegration and Stability in Africa.","Internal memo",,Africa,English,,"United Nations|UN Archive Collection: DPA Department of Political Affairs 2005 (May - Dec)",PDF,UN1730,"United Nations",,Memorandums,,"Africa,Disarmament, Demobilization and Reintegration (DDR),Inter-Agency Working Group,Internal memo",https://ccnydigitalscholarship.org/kofiannan/files/original/260effbe41bbfbee3b1863cc15d9e776.PDF,Text,"Internal Memo",1,0
8369,https://ccnydigitalscholarship.org/kofiannan/items/show/8369,"Proposed UN support to African Union peacekeeping capacity-building","7 March 2006","Kofi Annan",,"This is a Note to Mr. Guehenno about Proposed UN support to African Union peacekeeping capacity-building.","Internal memo",,Africa,English,,"United Nations|UN Archive Collection: EOSG 2006 Executive Office of the Secretary General",PDF,UN1979,"United Nations",,Memorandums,,"Africa,Internal memo,Support African Peacekeeping Capacity-building",https://ccnydigitalscholarship.org/kofiannan/files/original/4f7878feb72ed0ceb425367abe2f28ec.PDF,Text,"Internal Memo",1,0
8368,https://ccnydigitalscholarship.org/kofiannan/items/show/8368,"Letters to Messrs. konare, Sassou, Nguesso and Zenawi","20 March 2006",,,"This is a Note to Mr.Malloch Brown about Letters to Messrs. konare, Sassou, Nguesso and Zenawi.","Internal memo",,Africa,English,,"United Nations|UN Archive Collection: DPKO Department of Peacekeeping Operations - 2006 (Jan - Aug)",PDF,UN1998,"United Nations",,Memorandums,,"Africa,Internal memo,Peace and gratitude",https://ccnydigitalscholarship.org/kofiannan/files/original/26848d0930b4a7c134848f54d22bd5a0.PDF,Text,"Internal Memo",1,0
8331,https://ccnydigitalscholarship.org/kofiannan/items/show/8331,"Humanitarian Situation in the Democratic Republic of Timor-Leste","2 June 2006",,,"This is a note to the Secretary-General about Humanitarian situation in the Republic of Timor Leste.","Internal memo",,Africa,English,,"United Nations",PDF,UN2064,"United Nations",,Memorandums,,"Africa,Humanitarian Situation,Internal memo",https://ccnydigitalscholarship.org/kofiannan/files/original/4df4bcf60527327f207a4ccf5dfca130.pdf,Text,"Internal Memo",1,0
8307,https://ccnydigitalscholarship.org/kofiannan/items/show/8307,"Note to the Secretary-General: Annual Report on the Work of the Organization","2 June 2006",,,"This is a note regarding the Annual Report on the Work of Organization and Implementation Report of what the Organization has achieved over the past year, while the Implementation Report on the Millennium Declaration would focus on policy.","Internal memo",,Africa,English,,"United Nations",PDF,UN2063,"United Nations",,Memorandums,,"Africa,Annual Report,Internal memo",https://ccnydigitalscholarship.org/kofiannan/files/original/257e62c2f17c27c4a5542c9cdfe13096.pdf,Text,"Internal Memo",1,0
8229,https://ccnydigitalscholarship.org/kofiannan/items/show/8229,"Note to the Secretary-General","3 November 2006",,,"This document is a note to Secretary-General Kofi Annan about the overview of the Georgetown Conference which discussed Kofi Annan's legacy on Africa, especially with regards to the following themes: the fight against HIV/AIDS, strengthening governance and UN reform , ensuring human rights, and peace and security.","Internal memo",,Africa,English,,"United Nations|UN Archive Collection: DPA Department of Political Affairs 2006",PDF,UN2240,"United Nations",,Memorandums,,"Africa,Georgetown Conference,Internal memo,Legacy",https://ccnydigitalscholarship.org/kofiannan/files/original/04fd44d4d68192dab89e314b5619c079.PDF,Text,"Internal Memo",1,0
8116,https://ccnydigitalscholarship.org/kofiannan/items/show/8116,"Note to Mr Sise","23 June 2003","Warren Sach, Officer-in-charge, OPPBA",,"In this note, dated 23 June 2004, Warren Sach, Officer-in-charge, OPPBA informs Mr Sise about the the funding arrangements necessary to the payment, for the amount of $ 300,000, covering the expenses related to the rental of an aircraft for UN Secretary-General Kofi Annan' and his team during their travel to Sudan, UNMEE, UNON and African Union meeting.","Internal memo",,Sudan|Africa,English,,"United Nations|UN Archive Collection: OPPBF/Controller - Office /Programme Planning, Budget & Finance 2004",PDF,UN1477,"United Nations",,Memorandums,,"Africa,African Union,Aircraft,Internal memo,Rental,Sudan,Travel Sudan,UNMEE,UNON",https://ccnydigitalscholarship.org/kofiannan/files/original/3aef1952210abece9941fe60faf4be27.PDF,Text,"Internal Memo",1,0
8100,https://ccnydigitalscholarship.org/kofiannan/items/show/8100,"Note to Mr. Riza","10 February 2003","Kieran Prendergast",,"Kieran Prendergast informs S. Iqbal Riza, Chef de Cabinet about the commitment of the UN Secretary-General Kofi Annan to support the reform of the African Union, for the amount of $ 1 million to the African Union Reform Project. Prendergast reports that the Assistant Secretary-General for Africa in his consultations with donors to ensure the United States' support in not duplicate. Prendergast assured all UN Departments and Offices have been engaged on the field of realizing such huge project.|Note: Kieran Prendergast: "" Your approval is requested for funding of a UN Project in support of the African Union please.""
S. Iqbal Riza, Chef de Cabinet : "" Mr Prendergast, I trust core staff will be kept to minimum and funds used more for support from experts. Approved. Thanks""","Internal memo",,Africa,English,,"United Nations|UN Archive Collection: EOSG - Trust Fund for the Peace-making Activities of the SG 2002-2003",PDF,UN1197,"United Nations",,Memorandums,,"Africa,Chef De Cabinet,Internal memo,Kieran Prendergast,S. Iqbal Riza,UN Project In Support Of The African Union",https://ccnydigitalscholarship.org/kofiannan/files/original/1d79f1fb05cc49235ff74e56c1b1a1e0.PDF,Text,"Internal Memo",1,0
7917,https://ccnydigitalscholarship.org/kofiannan/items/show/7917,"Note to Mr. Riza: Draft Letters to Presidents Kabila and Kagame","3 July 2001","Jean-Marie Guéhenno",,"Jean-Marie Guehenno sends to S. Iqbal Riza, Chef de cabinet of the UN Secretary-General Kofi A. Annan, drafts letters ( to be signed by the UN Secretary-General Mr Annan and addressed to Presidents Joseph Kabila and Paul Kagame) regarding the application of the Lusaka Ceasefire agreement, the disengagement of forces and the withdrawal of foreign troops from the Democratic Republic of Congo as discussed in the margins of meetings in Lusaka and New York.","Internal memo",,Africa,English,,"United Nations|DPKO Department of Peacekeeping Operations (July - Dec) 2001",PDF,UN0903,"United Nations",,Memorandums,,"Africa,Chef De Cabinet,Democratic Republic Of Congo,Internal memo,Joseph Kabila,Paul Kagame,Rwanda,S. Iqbal Riza",https://ccnydigitalscholarship.org/kofiannan/files/original/200d67fb33be520d573b50f5533744dc.pdf,Text,"Internal Memo",1,0
7899,https://ccnydigitalscholarship.org/kofiannan/items/show/7899,"Secretary-General's Q&A at the UNA-USA National Convention","9 March 1999","Kofi Annan",,"Transcript of a question and answer session with Secretary-General Kofi Annan at a meeting of the UNA-USA national convention.",Interview,"United Nations|United Nations Secretary-General|Annan|Kofi A. (Kofi Atta)|United States|US debt to the UN|UN Reform|UNICEF|UNDP|UNFPA|NATO|Sanctions|Iraq|Kuwait|China|Robert Muller|ECOMOG|Africa|OAU",,English,,"United Nations",PDF,UN0405,"United Nations",,,,"Africa,China,ECOMOG,Interview,Iraq,Kuwait,NATO,OAU,Robert Muller,Sanctions,UN Reform,UNDP,UNFPA,UNICEF,United States,US Debt To The UN",https://ccnydigitalscholarship.org/kofiannan/files/original/75de0d3c045925431f2d4eb9029f9ab8.pdf,Text,Interviews,1,0
7891,https://ccnydigitalscholarship.org/kofiannan/items/show/7891,"Q & A with Secretary-General for the BBC World Service following a lecture Annan gave at the UN Headquarters","10 December 2002","Kofi Annan with BBC World Service",,"Transcript of Q & A with Secretary-General Kofi Annan and various for the BBC World Service at the UN Headquarters in New York after Annan gave a lecture on 10 December 2002. Annan talks about the UN's relationship to the media.",Interview,"United Nations|United Nations Secretary-General|Annan|Kofi A. (Kofi Atta)|Media|Tolerance|Freedom|Justice|Equal rights|Africa|Peace in Iraq|HIV/AIDS|UN Special Commission on Iraq (UNSCOM)|El Baradei|Mohamed|Hans Blix|Middle East|Africa|Sustainable Development|Colin Powell",Africa|Iraq,English,,"United Nations",PDF,UN9194,"United Nations","BBC World Service",,,"Africa,Colin Powell,Equal Rights,Freedom,Hans Blix,HIV/AIDS,Interview,Iraq,Justice,Media,Middle East,Mohamed El Baradei,Peace In Iraq,Sustainable Development,Tolerance,UN Special Commission on Iraq (UNSCOM)",https://ccnydigitalscholarship.org/kofiannan/files/original/6c46a28e70aa74a44350fafdac16fb02.pdf,Text,Interviews,1,0
7889,https://ccnydigitalscholarship.org/kofiannan/items/show/7889,"Interview with Barbara Crossette at the 16th Annual Meeting of ACUNS (Academic Council on the United Nations System)","12 June 2003","Kofi Annan and Barbara Crossette",,"Transcript of an interview at UN Headquarters in New York City with Secretary-General Kofi Annan by Barbara Crossette who had covered the UN for the New York Times for many years. Kofi Annan had just returned from a meeting with the US National Security Adviser and the US Secretary of State. They had a broad discussion, including the Iraq 2003 war which had just taken place.",Interview,"United Nations|United Nations Secretary-General|Annan|Kofi A. (Kofi Atta)|Sérgio Vieira de Mello|Middle East and Iraq War|Quartet|the (United States|Russia|the European Union|and the UN)|Colin Powell|Bush|George H.W|Mahmoud Abbas|Palestine|Bertini|Catherine Ann|Palestinian people and Humanitarian crisis|Oil-for-Food Programme|Africa|UN Children’s Fund (UNICEF)|Bellamy|Carol|HIV/AIDS in Africa|Zimbabwe|Robert Mugabe|Mbeki|Thabo|Reform of the Security Council",Iraq|Middle East|Africa,English,,"United Nations",PDF,UN9196,"United Nations",,,,"Africa,and the UN),Carol Bellamy,Catherine Bertini,Colin Powell,George H.W. Bush,HIV/AIDS In Africa,Interview,Iraq,Mahmoud Abbas,Middle East,Middle East and Iraq War,Oil-For-Food Programme,Palestine,Palestinian people and Humanitarian crisis,Reform Of The Security Council,Robert Mugabe,Russia,Sergio Vieira De Mello,Thabo Mbeki,The European Union,The Quartet (United States,The Quartet (United States, Russia, the European Union, and the UN),UN Children’s Fund (UNICEF),Zimbabwe",https://ccnydigitalscholarship.org/kofiannan/files/original/1e7ce22ab4f21e769ec2b6e090218263.pdf,Text,Interviews,1,0
7882,https://ccnydigitalscholarship.org/kofiannan/items/show/7882,"Interview with the Secretary-General on PBS Public Television with Charlie Rose","12 March 2002","Kofi Annan with Charlie Rose",,"Transcript of an interview with Secretary-General Kofi Annan by PBS host Charlie Rose. The focus of the discussion is on global poverty, but also covers current issues, including the Middle East.",Interview,"United Nations|United Nations Secretary-General|Annan|Kofi A. (Kofi Atta)|Poverty|Middle East|Ariel Sharon|Yasser Arafat|European Union (EU)|Russia|Abdulaziz bin Abdul Aziz Al Saud (crown prince of Saudi Arabia)|Terje Rod-Larsen|UN Special Commission on Iraq (UNSCOM)|Hans Blix|Hosni Mubarak|HIV/AIDS|Africa|Terrorism|Gates Foundation|Millennium Declaration|Global Alliance on Vaccination (GAVI)",Israel|Iraq,English,,"United Nations",PDF,UN9193,"United Nations",PBS,,,"Abdulaziz bin Abdul Aziz Al Saud (crown prince of Saudi Arabia),Africa,Ariel Sharon,European Union (EU),Gates Foundation,Global Alliance On Vaccination (GAVI),Hans Blix,HIV/AIDS,Hosni Mubarak,Interview,Iraq,Israel,Middle East,Millennium Declaration,Poverty,Russia,Terje Rod-Larsen,Terrorism,UN Special Commission on Iraq (UNSCOM),Yasser Arafat",https://ccnydigitalscholarship.org/kofiannan/files/original/279f0cd1fe08fc912903090ee4cf5de8.pdf,Text,Interviews,1,0
7874,https://ccnydigitalscholarship.org/kofiannan/items/show/7874,"Interview with the Secretary-General by Lyse Doucet of the BBC","4 December 2006","Kofi Annan with BBC",,"Transcript of an nterview with Secretary-General Kofi Annan by Lyse Doucet at the BBC and published on bbc.co.uk covering Annan's time as Secretary-General of the United Nations.",Interview,"United Nations|United Nations Secretary-General|Annan|Kofi A. (Kofi Atta)|Middle East and Iraq War|Iraq Study Group|James Baker|Lee Hamilton|Responsibility to Protect|Darfur|Peacekeeping|Sexual abuse by UN peacekeepers",Iraq|Africa,English,,"United Nations",PDF,UN9207,"United Nations","BBC News",,,"Africa,Darfur,Interview,Iraq,Iraq Study Group,James Baker,Lee Hamilton,Middle East and Iraq War,Peacekeeping,Responsibility To Protect,Sexual abuse by UN peacekeepers",https://ccnydigitalscholarship.org/kofiannan/files/original/e98bdc294e1c5bc34d58a1fbd0a20dd3.pdf,Text,Interviews,1,0
7556,https://ccnydigitalscholarship.org/kofiannan/items/show/7556,"Africa Cannot Grow or Be Free on an Empty Stomach","29 August 2005","Kofi Annan",,"Op-ed by Secretary-General Kofi Annan in The Financial Times (London) about hunger in Africa, the horrid situation the continent is facing, and the Secretary-General's perception on how the issue must be handled by the global community.",Op-Ed,Hunger|Africa|Globalization,Africa,English,,"United Nations",,UN2467,"United Nations","The Financial Times (London, England)",Documents,,"Africa,Hunger,Op-Ed",https://ccnydigitalscholarship.org/kofiannan/files/original/24145bd311e10e120420916e4abadce7.pdf,Text,OP-ED,1,0
7533,https://ccnydigitalscholarship.org/kofiannan/items/show/7533,"To Save Africa We Must Save Africa's Women","1 January 2003","Kofi Annan",,"Op-ed by Secretary-General Kofi Annan in The Independent (London) about AIDS and the danger it poses on Africa, and how the global community should come together to solve the issue.",Op-Ed,"Africa|AIDS (Disease)",Africa,English,,"United Nations",,UN2444,"United Nations","The Independent (UK)",Documents,,"Africa,HIV/AIDS,Op-Ed",https://ccnydigitalscholarship.org/kofiannan/files/original/17575f8f7c2857e1f10f8518160ddcd0.pdf,Text,OP-ED,1,0
7515,https://ccnydigitalscholarship.org/kofiannan/items/show/7515,"Mobilization Plus a Global Fund to Combat AIDS","27 April 2001","Kofi Annan",,"Op-ed by Secretary-General Kofi Annan in the International Herald Tribune on AIDS and other diseases, and how it is important that countries come together to find solutions, both long term and short term, to solve this issue.",Op-Ed,"AIDS (Disease)",Africa,English,,"United Nations",,UN2426,"United Nations","International Herald Tribune",Documents,,"Africa,HIV/AIDS,Op-Ed",https://ccnydigitalscholarship.org/kofiannan/files/original/9c393e86359f7588d707749beab6e5ef.pdf,Text,OP-ED,1,0
7512,https://ccnydigitalscholarship.org/kofiannan/items/show/7512,"Africa's thirst for democracy","5 December 2000","Kofi Annan",,"Op-ed by Secretary-General Kofi Annan in the International Herald Tribune on how important democracy is and the continent of Africa is in dire need of it in order to ensure that socioeconomic development is happening in the proper manner.",Op-Ed,Democracy,Africa,English,,"United Nations",,UN2423,"United Nations","International Herald Tribune",Documents,,"Africa,Democracy,Op-Ed",https://ccnydigitalscholarship.org/kofiannan/files/original/02f022a5893b0629479a45282dd52813.pdf,Text,OP-ED,1,0
7498,https://ccnydigitalscholarship.org/kofiannan/items/show/7498,"Africa: The Horror . . .","1 August 1999","Kofi Annan",,"Op-ed by Secretary-General Kofi Annan in The Washington Post on the situation in Africa, especially with the atrocities that the continent is facing. Furthermore, the op-ed discusses how the international community needs to come together to find solutions for this problem.",Op-Ed,"United Nations",Africa,English,,"United Nations",,UN2409,"United Nations","Washington Post",Documents,,"Africa,Op-Ed",https://ccnydigitalscholarship.org/kofiannan/files/original/85e1d96951971b7ff672a1dceef2fcc7.pdf,Text,OP-ED,1,0
7497,https://ccnydigitalscholarship.org/kofiannan/items/show/7497,"Window of African Promise Amid Great Suffering","31 July 1999","Kofi Annan",,"Op-ed by Secretary-General Kofi Annan in the International Herald Tribune (Neuilly-sur-Seine, France) on the situation in Africa, especially with the atrocities that the continent is facing. Furthermore, the op-ed discusses how the international community needs to come together to find solutions for this problem.",Op-Ed,"United Nations",Africa,English,,"United Nations",,UN2408,"United Nations","International Herald Tribune",Documents,,"Africa,Op-Ed",https://ccnydigitalscholarship.org/kofiannan/files/original/151e22dc6dd5a741a1e742f46ef7e007.pdf,Text,OP-ED,1,0
7490,https://ccnydigitalscholarship.org/kofiannan/items/show/7490,"We All Must Feel Responsible for African Violence","30 April 1998","Kofi Annan",,"Op-ed by Secretary-General Kofi Annan in The Gazette (Montreal, Canada) on how African violence is persistent and needs to be addressed throughout the international community, especially in individual countries and the United Nations.",Op-Ed,"Violence|United Nations",Africa,English,,"United Nations",,UN2401,"United Nations","The Gazette",Documents,,"Africa,Op-Ed,Violence",https://ccnydigitalscholarship.org/kofiannan/files/original/a5de83e847539d28fc5561f74ab6b2e1.pdf,Text,OP-ED,1,0
