﻿"Item Id","Item URI","Dublin Core:Title","Dublin Core:Date","Dublin Core:Creator","Dublin Core:Contributor","Dublin Core:Description","Dublin Core:Type","Dublin Core:Subject","Dublin Core:Coverage","Dublin Core:Language","Dublin Core:Relation","Dublin Core:Source","Dublin Core:Format","Dublin Core:Identifier","Dublin Core:Rights","Dublin Core:Publisher","Item Type Metadata:Original Format","PDF Text:Text",tags,file,itemType,collection,public,featured
8789,https://ccnydigitalscholarship.org/kofiannan/items/show/8789,"Note to Mr. Corell: Request for legal opinion","22 March 2001","Benon V. Sevan",,"Internal note from Benon V. Sevan, the head of the Oil-for-Food Programme to Corell Hans, Under-Secretary-General for Legal Affairs, asking for a legal opinion regarding difficulties in obtaining the necessary visas to enter Iraq for the United Nations personnel.","Internal memo",,Iraq,English,,"United Nations|UN Archive Collection: Relief OPS-OCHA Iraq Programme 2001 (Jan-Apr)",PDF,UN0537-1,"United Nations",,Memorandums,,"Internal memo,Iraq,Iraq and Memorandum Understanding (1996),Oil-For-Food Programme,Resolution",https://ccnydigitalscholarship.org/kofiannan/files/original/78acf1ab37366947f1107cd38fb0d3cb.pdf,Text,"Internal Memo",1,0
8534,https://ccnydigitalscholarship.org/kofiannan/items/show/8534,"Note to Mr. Oshima","7 April 2003","S. Iqbal Riza",,"Note to Kenzo Oshima from S. Iqbal Riza pertaining to sending updates to Kofi Annan with regards to the humanitarian situation in Iraq.","Internal memo",,Iraq,English,,"United Nations|UN Archive Collection: RELIEF OPS/OCHA - 2003 - Office for the Coordination of Humanitarian Affairs/Office of the Emergency Relief Coordinator",PDF,UN1229,"United Nations",,Memorandums,,"Internal memo,Iraq,Iraq and Humanitarian situation in Iraq,Kenzo Oshima,S. Iqbal Riza",https://ccnydigitalscholarship.org/kofiannan/files/original/1f0a756099a546cb752026e772976a6b.PDF,Text,"Internal Memo",1,0
8433,https://ccnydigitalscholarship.org/kofiannan/items/show/8433,"Note to Mr. Riza","27 January 2004",,,"Plans on human rights activities in Iraq","Internal memo",,Iraq,English,,"United Nations|UN Archive Collection: OLA Office of Legal Affairs 2004 (Jan - Sept)",PDF,UN1376,"United Nations",,Memorandums,,"Human Rights,Human Rights In Iraq,Internal memo,Iraq",https://ccnydigitalscholarship.org/kofiannan/files/original/a2a5e265b12967d7bb393242637bd993.PDF,Text,"Internal Memo",1,0
8798,https://ccnydigitalscholarship.org/kofiannan/items/show/8798,"Note to Mr. Sergio Vieira de Mello: Iraq","18 December 1998","S. Iqbal Riza, Chef de Cabinet for the UN Secretary-General Kofi Annan",,"S. Iqbal Riza, Chef de Cabinet for the UN Secretary-General Kofi Annan forwards guidelines to Mr Sergio Vieira de Mello in regards to United Nations Humanitarian Staff in Geneva and action plan towards UN personnel in Iraq. Guidelines follows the conclusions of the meetings between UN Secretary-General Kofi Annan, mr Sevan and S. Iqbal Riza","Internal memo",,Iraq,English,,"United Nations|UN Archive Collection: OCHA OCHA/OERC: Office for Coordination of Humanitarian Affairs/Office of the ERG 1997 -98",PDF,UN0379,"United Nations",,Memorandums,,"Internal memo,Iraq,S. Iqbal Riza,Sergio Vieira De Mello",https://ccnydigitalscholarship.org/kofiannan/files/original/3a6f881b03ee7f3b44e887d8185a7145.PDF,Text,"Internal Memo",1,0
8071,https://ccnydigitalscholarship.org/kofiannan/items/show/8071,"Note to Ms. Barcena","21 September 2006","Ibrahim Gambari",,"This document is a series of notes and a document about the security council meeting on Iraq and overall analysis of issues regarding the matter. The document also has a note attached regarding this to Ms. Barcena","Internal memo",,Iraq,English,,"United Nations|UN Archive Collection: DPA - Security Council Matters - General 2006",PDF,UN2188,"United Nations",,Memorandums,,"Internal memo,Iraq,Security Council",https://ccnydigitalscholarship.org/kofiannan/files/original/9607ca7ba6518f2d0d8b1f31c9da59a2.PDF,Text,"Internal Memo",1,0
6690,https://ccnydigitalscholarship.org/kofiannan/items/show/6690,"Note to Ms. Bárcena: Distinct Entity Trust Fund","5 December 2006","Ibrahim Gambari",,"This document is about the Distinct Entity Trust Fund for Iraq in order to support the United Nations presence in the country.","Internal memo",,Iraq,English,,"United Nations|DPA Department of Political Affairs 2006",PDF,UN2275,"United Nations",,Memorandums,,"Distinct Entity Trust Fund,Internal memo,Iraq",https://ccnydigitalscholarship.org/kofiannan/files/original/817595b260d79b5d02239d6c7bf63f43.PDF,Text,"Internal Memo",1,0
8312,https://ccnydigitalscholarship.org/kofiannan/items/show/8312,"Note to Ms. Bárcena: Security Council Meeting on Iraq -- Analysis of the Security Council Meeting on Iraq (15 June 2006)","16 June 2006","Angela Kane",,"This is a note about the Security Council's meeting on Iraq for attention of the Secretary-General.","Internal memo",,Iraq,English,,"United Nations|UN Archive Collection: DPA - Security Council Matters - General 2006",PDF,UN2078,"United Nations",,Memorandums,,"Internal memo,Iraq,Meeting On Iraq",https://ccnydigitalscholarship.org/kofiannan/files/original/e859b7d78be4e6e2cdd15348028bf036.PDF,Text,"Internal Memo",1,0
8418,https://ccnydigitalscholarship.org/kofiannan/items/show/8418,"Note to Ms. Bertini on the Independent Inquiry into OIP","24 March 2003",,,"Note to Ms. Bertini on the Independent Inquiry into the Oil for Food Programme|Note: Handwritten note by Kofi Annan: ""Please brief Jean-Pierre on our meeting with Council members this afternoon and the preference for UN funding of the investigation.","Internal memo",,Iraq,English,,"United Nations|UN Archive Collection: OPPBF/Controller - Office /Programme Planning, Budget & Finance 2004",PDF,UN1415,"United Nations",,Memorandums,,"Accounting Issue,Internal memo,Iraq,Oil-For-Food Programme",https://ccnydigitalscholarship.org/kofiannan/files/original/2957192ceef622f6ab8d132dae72407d.PDF,Text,"Internal Memo",1,0
6805,https://ccnydigitalscholarship.org/kofiannan/items/show/6805,"Note to Ms. Perkin","31 January 2006","Kofi Annan",,"This is a Note about the Operation of Security Council.","Internal memo",,"United States|China|Denmark|United Kingdom|Afghanistan|Sudan|Haiti|Iraq",English,,"United Nations",PDF,Un1944,"United Nations",,Memorandums,,"Afghanistan,China,Denmark,Fast-breaking Events,Haiti,Internal memo,Iraq,Overnight Events,Peacekeeping Operations,Sudan,United Kingdom,United States",https://ccnydigitalscholarship.org/kofiannan/files/original/6940a1cc8aa541e69911a2a92cef0adb.pdf,Text,"Internal Memo",1,0
8517,https://ccnydigitalscholarship.org/kofiannan/items/show/8517,"Note to S. Iqbal Riza - Iraq: Revised Concept of Operations","2 April 2003","Executive Office of the UN Secretary-General|Kenzo Oshima",,"Note to S. Iqbal Riza from Kenzo Oshima pertaining to revised concepts of operation within Iraq.","Internal memo",,Iraq,English,,"United Nations|UN Archive Collection: RELIEF OPS/OCHA - 2003 - Office for the Coordination of Humanitarian Affairs/Office of the Emergency Relief Coordinator",PDF,UN1228,"United Nations",,Memorandums,,"Internal memo,Iraq,Kenzo Oshima,S. Iqbal Riza",https://ccnydigitalscholarship.org/kofiannan/files/original/7f59968c60c77dee52edf3c0560f2911.PDF,Text,"Internal Memo",1,0
7049,https://ccnydigitalscholarship.org/kofiannan/items/show/7049,"Note to S. Iqbal Riza from Kofi Annan","10 October 2003","S. Iqbal Riza",,"UN does not want to run Iraq, but the will assist in rebuilding","Internal memo",,Iraq,English,,"United Nations|EOSG Office of the Spokesman 2003",PDF,UN1321,"United Nations",,Memorandums,,"Assist,Internal memo,Iraq,Rebuild",https://ccnydigitalscholarship.org/kofiannan/files/original/abf3375c8f0bddb5b8ac8ba63fa23c84.PDF,Text,"Internal Memo",1,0
8840,https://ccnydigitalscholarship.org/kofiannan/items/show/8840,"Note to S. Iqbal Riza on Team to Baghdad","23 March 2004",,,"Note to S. Iqbal Riza on Team to Baghdad and how to handle the UN-based press corps sensitivity on the team's visit.","Internal memo",,Iraq,English,,"United Nations|UN Archive Collection: EOSG Office of the Spokesman 2004",PDF,UN1414,"United Nations",,Memorandums,,"Internal memo,Iraq,UN Secretariat/staff Arrival In Baghdad",https://ccnydigitalscholarship.org/kofiannan/files/original/d38ba5be8c5fe2766d30e1a148374b54.PDF,Text,"Internal Memo",1,0
6537,https://ccnydigitalscholarship.org/kofiannan/items/show/6537,"Note to Secretary-General","9 January 2003","S. Iqbal Riza",,"Ambassador de La Sabliere of France wanted to convey details of upcoming meeting on Iraq and counter-terrorism","Internal memo",,Iraq,English,,"United Nations|EOSG 2003 Executive Office of the Secretary General",PDF,UN1184,"United Nations",,Memorandums,,"Ambassador,Counter-terrorism,Internal memo,Iraq,Meeting",https://ccnydigitalscholarship.org/kofiannan/files/original/fdfed4d6b6175af9e5e33a84833f2f41.PDF,Text,"Internal Memo",1,0
8773,https://ccnydigitalscholarship.org/kofiannan/items/show/8773,"Note to Secretary-General from John Ruggie","12 February 1999","John Ruggie",,"Note from John G. Ruggie to Secretary-General Kofi Annan reporting on Ruggie's visit to Washington DC and his meeting with Tom Pickering, David Welch, and Bill Wood.","Internal memo",,Libya|Iraq,English,,"United Nations",PDF,UN0393,"United Nations",,Memorandums,,"Disarmament,Disarmament In Iraq,Internal memo,Iraq,Libya,Libya and Lifting sanctions,UN Dues Unpaid Assessments",https://ccnydigitalscholarship.org/kofiannan/files/original/ec9e76924e9c4d64165d8a3b9ceada83.pdf,Text,"Internal Memo",1,0
5615,https://ccnydigitalscholarship.org/kofiannan/items/show/5615,"Note to the Deputy Secretary-General: Follow-up to the recent LDC III conference","1 June 2001","Kofi Annan",,"UN Secretary-general Kofi Annan gives full powers to Mr Hans Corell, Under-Secretary-General, legal Counsel, to sign the letter to the Permanent Representation of Iraq to the United Nations, regarding the extension of the Memorandum of Understanding of 20 May 1996 for an additional period until 3 July 2001.","Internal memo",,,English,,"United Nations|EOSG 2001 Executive Office of the Secretary General",PDF,UN0878,"United Nations",,Memorandums,,"Hans Corell,Internal memo,Iraq,Memorandum Of Understanding",https://ccnydigitalscholarship.org/kofiannan/files/original/6ae8b335355b8acc1cca9f468769cdda.pdf,Text,"Internal Memo",1,0
4970,https://ccnydigitalscholarship.org/kofiannan/items/show/4970,"Note to the Secretary-General","12 January 2005","Elisabeth Lindemnaycr",,"DPA SECCO Reports and Activities 2005","Internal memo",,,English,,"United Nations|DPA SECCO Reports and Activities 2005",PDF,UN1605,"United Nations",,Memorandums,,"Côte d'Ivoire,Internal memo,Iraq,Somalia,Sudan,Tsunami Relief Efforts - Update",https://ccnydigitalscholarship.org/kofiannan/files/original/5b5c17a38183f83eb9a95b2a4d903786.PDF,Text,"Handwritten Notes",1,0
8857,https://ccnydigitalscholarship.org/kofiannan/items/show/8857,"Note to the Secretary-General","26 January 2005","Shashi Tharoor",,"This is a note concerning the communications strategy that the UN must develop towards the publicity regarding the role of the UN and the organization's opinion of the process and the outcome of the Iraqi elections.","Internal memo",,,English,,"United Nations|UN Archive Collection: DPI Department of Public Information 2005",PDF,UN1614,"United Nations",,Memorandums,,"Communication,Elections,Internal memo,Iraq",https://ccnydigitalscholarship.org/kofiannan/files/original/c33aed0926ea03d542bb5dd012ae645f.PDF,Text,"Internal Memo",1,0
8503,https://ccnydigitalscholarship.org/kofiannan/items/show/8503,"Note to the Secretary-General on Disarmament","22 January 2003","Jayantha Dhanapala",,"Describes the agenda and the schedule for the meeting|Note: Handwritten note by Kofi Annan: ""Noted""","Internal memo",,,English,,"United Nations|UN Archive Collection: Disarmament 2003 - General",PDF,UN1190,"United Nations",,Memorandums,,"Agenda,Crisis,Development,Disarmament,Internal memo,Iraq,Meeting,Schedule",https://ccnydigitalscholarship.org/kofiannan/files/original/6cff72430f89a9e37b929522fc1abd46.PDF,Text,"Internal Memo",1,0
8488,https://ccnydigitalscholarship.org/kofiannan/items/show/8488,"Note to the Secretary-General on Oil-for-Food Inquiry","15 April 2004",,,"Note to the Secretary-General on Oil-for-Food Inquiry proposing a communications strategy|Note: Handwritten note by Kofi Annan: ""Many thanks, lots of work has gone into this. I find the proposals sound and practical. KA 18/4""","Internal memo",,Iraq,English,,"United Nations|UN Archive Collection: OCHA - UN Coordinator for Humanitarian Assistance in Baghdad",PDF,UN1431,"United Nations",,Memorandums,,"Communication,Internal memo,Iraq,Oil-For-Food Programme,Priority",https://ccnydigitalscholarship.org/kofiannan/files/original/f3a6551b5c371b83bb697d1852288a99.PDF,Text,"Internal Memo",1,0
6503,https://ccnydigitalscholarship.org/kofiannan/items/show/6503,"Note to the Secretary-General re: Security Council Luncheon for July 2003","15 July 2003","Elisabeth Lindenmayer",,"Note to the Secretary-General re: Security Council Luncheon for July 2003 requesting that the agenda not be too ambitious and focus on Iraq (and Liberia, if necessary).","Internal memo",,Liberia|Iraq,English,,"United Nations|EOSG 2003 Executive Office of the Secretary General",PDF,UN1265,"United Nations",,Memorandums,,"Internal memo,Iraq,Liberia,Sergio Vieira De Mello,UN Security Council,UN Security Council Monthly Luncheons",https://ccnydigitalscholarship.org/kofiannan/files/original/51328ac984b3fd9ee622dd88bbed3c21.PDF,Text,"Internal Memo",1,0
8527,https://ccnydigitalscholarship.org/kofiannan/items/show/8527,"Note to the Secretary-General: Concept of Operations for Iraq - Re-entry Strategy","22 April 2003","Kenzo Oshima",,"This is a note to Kofi Annan pertaining to a re entry strategy into Iraq back in 2003 when there was a humanitarian imitative taking place","Internal memo",,Iraq,English,,"United Nations|UN Archive Collection: RELIEF OPS/OCHA - 2003 - Office for the Coordination of Humanitarian Affairs/Office of the Emergency Relief Coordinator",PDF,UN1237,"United Nations",,Memorandums,,"Internal memo,Iraq,Iraq and Humanitarian situation in Iraq",https://ccnydigitalscholarship.org/kofiannan/files/original/fce85c21217b0b61320f9dc5b8490cf6.PDF,Text,"Internal Memo",1,0
7028,https://ccnydigitalscholarship.org/kofiannan/items/show/7028,"Note to the Secretary-General: High-Level Meeting on Iraq on 18 September -- Update","1 September 2006",,,"This document is a note on the United nations high level meeting on Iraq at the United Nations Headquarters on the 18th of September.","Internal memo",,Iraq,English,,"United Nations|DPA Department of Political Affairs 2006",PDF,UN2177,"United Nations",,Memorandums,,"High-Level Meeting,Internal memo,Iraq",https://ccnydigitalscholarship.org/kofiannan/files/original/e0f567e751b9fa83b844378766355e53.PDF,Text,"Internal Memo",1,0
8843,https://ccnydigitalscholarship.org/kofiannan/items/show/8843,"Note to the Secretary-General: Holds on applications under the oil-for-food programme","26 March 2001",,,"Internal note from Benon V. Sevan, the head of the Oil-for-Food Programme, to S. Iqbal Riza, transmitting a note to the Secretary-General regarding the holds on the program.","Internal memo",,Iraq,English,,"United Nations|UN Archive Collection: Relief OPS-OCHA Iraq Programme 2001 (Jan-Apr)",PDF,UN0841,"United Nations",,Memorandums,,"Internal memo,Iraq,Oil-For-Food Programme,Resolution",https://ccnydigitalscholarship.org/kofiannan/files/original/eeba1581231fa736faf5d03aef6c7c32.pdf,Text,"Internal Memo",1,0
7333,https://ccnydigitalscholarship.org/kofiannan/items/show/7333,"Note to the Secretary-General: Meeting with Regional and Negotiating Groups","29 November 2005","Robert Orr",,"Note to the Secretary-General regarding his meetings with Regional and Negotiating Groups.","Internal memo",,"Rwanda|Iraq|Romania|Barbados|Canada|Mauritania|Jamaica|Malaysia|United Kingdom|Yemen|Australia|Bahamas",English,,"United Nations|EOSC 2005 Executive Office of the Secretaryy General",PDF,UN1890,"United Nations",,Memorandums,,"Australia,Bahamas,Barbados,Canada,Executive Office Of The Secretary-General (EOSG),Internal memo,Iraq,Jamaica,Malaysia,Mauritania,Negotiating Groups,Regional Groups,Romania,Rwanda,United Kingdom,Yemen",https://ccnydigitalscholarship.org/kofiannan/files/original/1c0e38cfcd22c4f038407bb504bf7ea3.PDF,Text,"Internal Memo",1,0
