﻿"Item Id","Item URI","Dublin Core:Title","Dublin Core:Date","Dublin Core:Creator","Dublin Core:Contributor","Dublin Core:Description","Dublin Core:Type","Dublin Core:Subject","Dublin Core:Coverage","Dublin Core:Language","Dublin Core:Relation","Dublin Core:Source","Dublin Core:Format","Dublin Core:Identifier","Dublin Core:Rights","Dublin Core:Publisher","Item Type Metadata:Original Format","PDF Text:Text",tags,file,itemType,collection,public,featured
4766,https://ccnydigitalscholarship.org/kofiannan/items/show/4766,"Secretary-General Visits Refugee Camps in Chad","02 July 2004",,,"Sudanese refugees at Iridimi Camp in Chad which was visited by Secretary-General Kofi Annan today.",Photographs,"Refugee camps",Chad,,,"United Nations, UN Photo/Eskinder Debebe",JPEG,ANNANPHOTO0067,"United Nations",,Photograph,,"Chad,Iridimi Camp,Iridimi Refugee Camp,Photograph,Refugee camp",https://ccnydigitalscholarship.org/kofiannan/files/original/1829b9d03471d1bea0805208eb2ad2fc.jpg,"Still Image",Photographs,1,0
4767,https://ccnydigitalscholarship.org/kofiannan/items/show/4767,"Secretary-General Visits Refugee Camps in Chad","02 July 2004",,,"Sudanese refugees in Iridimi Camp in Chad which was visited by Secretary General Kofi Annan today.",Photographs,"Refugee camps",Chad,,,"United Nations, UN Photo/Eskinder Debebe",JPEG,ANNANPHOTO0069,"United Nations",,Photograph,,"Chad,Iridimi Camp,Iridimi Refugee Camp,Photograph,Refugee camp",https://ccnydigitalscholarship.org/kofiannan/files/original/84215b2147264625b978f9d4c8cdba30.jpg,"Still Image",Photographs,1,0
4768,https://ccnydigitalscholarship.org/kofiannan/items/show/4768,"Secretary-General Visits Refugee Camps in Chad","02 July 2004",,,"Refugees from Sudan holding up a banner during the visit of Secretary- General Kofi Annan at Iridimi Camp in Chad.",Photographs,"Refugee camps",Chad,,,"United Nations, UN Photo/Eskinder Debebe",JPEG,ANNANPHOTO0070,"United Nations",,Photograph,,"Chad,Iridimi Camp,Iridimi Refugee Camp,Photograph,Refugee camp",https://ccnydigitalscholarship.org/kofiannan/files/original/176c1c34d9181aa995657a811d956411.jpg,"Still Image",Photographs,1,0
4769,https://ccnydigitalscholarship.org/kofiannan/items/show/4769,"Secretary-General Visits Refugee Camps in Chad","02 July 2004",,,"Secretary General Kofi Annan (centre) on his way to visit Sudanese refugees in Iridimi Camp in Chad.",Photographs,"Refugee camps",Chad,,,"United Nations, UN Photo/Eskinder Debebe",JPEG,ANNANPHOTO0071,"United Nations",,Photograph,,"Chad,Iridimi Camp,Iridimi Refugee Camp,Photograph,Refugee camp",https://ccnydigitalscholarship.org/kofiannan/files/original/b88239b94347810307dd8669b5899eba.jpg,"Still Image",Photographs,1,1
4770,https://ccnydigitalscholarship.org/kofiannan/items/show/4770,"Secretary-General Visits Refugee Iridimi Camps in Chad","02 July 2004",,,"Sudanese refugees in Iridimi Camp in Chad which was visited by Secretary General Kofi Annan today.",Photographs,"Refugee camps",Chad,,,"United Nations, UN Photo/Eskinder Debebe",JPEG,ANNANPHOTO0072,"United Nations",,Photograph,,"Chad,Iridimi Camp,Iridimi Refugee Camp,Photograph,Refugee camp",https://ccnydigitalscholarship.org/kofiannan/files/original/74d45ba4f379b70e5e4d03c86853b209.jpg,"Still Image",Photographs,1,0
4771,https://ccnydigitalscholarship.org/kofiannan/items/show/4771,"Secretary-General Outlines Plan for Radical UN Reform","21 March 2005",,,"Secretary-General Kofi Annan (right) and Deputy Secretary-General Louise Fréchette (left) walking towards the General Assembly hall to deliver his speech on UN reform.",Photographs,"United Nations|Reform","United States",,,"United Nations, UN Photo/Eskinder Debebe",JPEG,ANNANPHOTO0075,"United Nations",,Photograph,,"Photograph,Reform of the United Nations,United States",https://ccnydigitalscholarship.org/kofiannan/files/original/73199045e7ed9835f7950ce45d40d5e0.jpg,"Still Image",Photographs,1,0
4772,https://ccnydigitalscholarship.org/kofiannan/items/show/4772,"Secretary-General, Heads of Principal Organs of United Nations Hold Annual Meeting","25 October 2005",,,"Secretary-General Kofi Annan (centre) is pictured with the heads of the six Principal Organs of the United Nations (General Assembly, Security Council, Economic and Social Council, Trusteeship Council, International Court of Justice and the Secretariat) when they held their seventh annual meeting in New York today. Left to right are Nicolas Michel, Under-Secretary-General for Legal Affairs and United Nations Legal Counsel|Ibrahim Gambari, Under-Secretary-General for Political Affairs|Shi Jiuyong, President of the International Court of Justice (ICJ)|Munir Akram, Permanent Representative of Pakistan to the United Nations and President of ECOSOC|Mr. Annan|Jan Eliasson, President of the sixtieth session of the General Assembly|Michel Duclos, Deputy Permanent Representative of France to the United Nations and President of the Trusteeship Council|Deputy Secretary-General Louise Fréchette|and Jean-Marie Guéhenno, Under-Secretary-General for Peacekeeping Operations.",Photographs,,"United States",,,"United Nations, UN Photo/Eskinder Debebe",JPEG,ANNANPHOTO0076,"United Nations",,Photograph,,"Photograph,United States",https://ccnydigitalscholarship.org/kofiannan/files/original/ebe6ab3d569404c7f8b5b7627d172518.jpg,"Still Image",Photographs,1,0
4773,https://ccnydigitalscholarship.org/kofiannan/items/show/4773,"Cnn Interviews Secretary-General","13 February 2006",,,"Secretary-General Kofi Annan (right) is interviewed by CNN's Wolf Blitzer at the CNN studios in Washington, DC, today.",Photographs,,"Washington, D.C.|United States",,,"United Nations, UN Photo/Eskinder Debebe",JPEG,ANNANPHOTO0077,"United Nations",,Photograph,,"CNN,Interview,Photograph,United States,Washington D.C.,Washington, D.C.",https://ccnydigitalscholarship.org/kofiannan/files/original/da58f853633d4c454539467908f257d6.jpg,"Still Image",Photographs,1,1
4774,https://ccnydigitalscholarship.org/kofiannan/items/show/4774,"Annan Proposes Overhaul of United Nations to Realign Operations From Headquarters to Field","07 March 2006",,,"Secretary-General Kofi Annan addresses the General Assembly when he presented his proposals for a far-reaching overhaul of the United Nations, at UN Headquarters in New York.",Photographs,,"United States",,,"United Nations, UN Photo/Mark Garten",JPEG,ANNANPHOTO0078,"United Nations",,Photograph,,"Photograph,United States",https://ccnydigitalscholarship.org/kofiannan/files/original/9f1adb908a7eb95c7da38de06c027fed.jpg,"Still Image",Photographs,1,0
4775,https://ccnydigitalscholarship.org/kofiannan/items/show/4775,"Secretary-General Arrives in South Africa on Official Visit","14 March 2006",,,"Secretary-General Kofi Annan (left) is pictured with South African President Thabo Mbeki, when he inspected an honour guard for him when he arrived at Tuynhuys, the Presidential Palace in Cape Town at the start of a three day official visit today.",Photographs,,"Cape Town|South Africa",,,"United Nations, UN Photo/Eskinder Debebe",JPEG,ANNANPHOTO0079,"United Nations",,Photograph,,"Cape Town,Photograph,South Africa",https://ccnydigitalscholarship.org/kofiannan/files/original/6d4484ca5f76fcd8e82eb3c3e7fd7bd1.jpg,"Still Image",Photographs,1,0
4777,https://ccnydigitalscholarship.org/kofiannan/items/show/4777,"Secretary-General Visits UN Mission's Eastern Division Headquarters in Democratic Republic of Congo","23 March 2006",,,"Secretary-General Kofi Annan (third from left, seated) sits for a group photo with officers of the United Nations Organization Mission in the Democratic Republic of the Congo (MONUC) Eastern Division Headquarters, in Kisangani, Democratic Republic of the Congo. His Special Representative in the DRC, William Lacy Swing, is second from left.",Photographs,,"Kisangani|Democratic Republic of the Congo",,,"United Nations, UN Photo/Eskinder Debebe",JPEG,ANNANPHOTO0081,"United Nations",,Photograph,,"Democratic Republic Of Congo,Kisangani,Photograph",https://ccnydigitalscholarship.org/kofiannan/files/original/cff87c1479bb3a4085b1b5a6e189be07.jpg,"Still Image",Photographs,1,0
4779,https://ccnydigitalscholarship.org/kofiannan/items/show/4779,"From Ghana to the World Stage",,,,,,,,,,,,,,,,,,https://ccnydigitalscholarship.org/kofiannan/files/original/3e001a56bdf15a03d387095837bdf0b5.pdf,,,1,0
4827,https://ccnydigitalscholarship.org/kofiannan/items/show/4827,"Interview with the Secretary-General and Al Jazeera","1 August 2006","Kofi Annan with Al-Jazeera",,"Transcript of an interview with Secretary-General Kofi Annan by Al-Jazeera discussing the fighting over the Israeli and Lebanon border with Hezbollah. The war has been intensifying.",Interview,"United Nations|United Nations Secretary-General|Annan|Kofi A. (Kofi Atta)|Israel-Hezbollah| conflict over border with Lebanon|George W. Bush|George W. Bush in Lebanon|Hezbollah|UN Security Council|Lebanon and Humanitarian crisis",Lebanon|Israel,English,,"United Nations",PDF,UN9206,"United Nations","Al Jazeera",,," Lebanon,George W. Bush,George W. Bush,Hizballah (Lebanon),Humanitarian Crisis,UN Security Council,Hezbollah,Hizballah (Lebanon),Humanitarian Crisis,Interview,Israel,Israel-Hezbollah,Lebanon,Lebanon and Humanitarian crisis,UN Security Council",https://ccnydigitalscholarship.org/kofiannan/files/original/02ff551488cf80554f8653a9435de58a.pdf,Text,Interviews,1,0
4881,https://ccnydigitalscholarship.org/kofiannan/items/show/4881,"Letter to Baboucarr-Blaise Ismaila Jagne, President of the Security Council, regarding the appointment of Secretary-General's resident Special Representative and Chief of the UN Operation in Cyprus","20 June 1999","Kofi Annan",,"Letter from Secretary-General Kofi Annan to Baboucarr-Blaise Ismaila Jagne, President of the Security Council, informing the Annan's intention to appoint Ann Hercus as Secretary-General's resident Special Representative and Chief of the UN Operation in Cyprus.",Letter,"United Nations|United Nations. Secretary-General|Annan, Kofi A. (Kofi Atta)|Hercus, Dame Ann; Diego Cordovez; UN Force in Cyprus; UN Office in Cyprus",Cyprus,English,,"United Nations",PDF,UN0480,"United Nations","United Nations","Letters (Correspondence)",,,https://ccnydigitalscholarship.org/kofiannan/files/original/80524ec5ffe21153640873078574a729.pdf,Text,Letters,1,0
4882,https://ccnydigitalscholarship.org/kofiannan/items/show/4882,"Letter From Kofi Annan to the President of the Security Council A. Peter Burleigh","23 November 1998","Kofi Annan",,"Letter from Secretary-General Kofi Annan to the President of the Security Council, A. Peter Burleigh, conveying his intention to deploy civilian monitors in Afghanistan called Civil Affairs Unit within the UN Special Mission to Afghanistan (UNSMA), and asked to bring it to the attention of the members of the Security Council.",Letter,"United Nations|United Nations. Secretary-General|Annan, Kofi A. (Kofi Atta)|Kofi Annan; Peter Burleigh; UN Special Mission to Afghanistan (UNSMA)",Afghanistan,English,,"United Nations",PDF,UN0355,"United Nations","United Nations",,,,https://ccnydigitalscholarship.org/kofiannan/files/original/59e9e0e52f66ec3a9a33705ccdd07e24.pdf,Text,Letters,1,0
4883,https://ccnydigitalscholarship.org/kofiannan/items/show/4883,"Letter From the President of the Security Council A. Peter Burleigh to the Secretary-General Kofi Annan","17 November 1998",,,"Letter from A. Peter Burleigh, President of the Security Council, to the Secretary-General Kofi Annan, informing him that his letter concerning his proposal to extend the Office of his Personal Representative in Cambodia has been brought to the attention of the members of the Council.",Letter,"United Nations|United Nations. Secretary-General|Annan, Kofi A. (Kofi Atta)|Peter Burleigh; Kofi Annan; United Nations and Cambodia",Cambodia,English,,"United Nations",PDF,UN0351,"United Nations","United Nations",,,,https://ccnydigitalscholarship.org/kofiannan/files/original/4133fe447f3dd4d8ab5407b27457ec1a.pdf,Text,Letters,1,0
4884,https://ccnydigitalscholarship.org/kofiannan/items/show/4884,"Letter to the Security Council, conveying the letter from Javier Solana, the Secretary-General of NATO","21 June 1999","Kofi Annan",,"Letter from Secretary-General Kofi Annan to Baboucarr-Blaise Ismaila Jagne, President of the Security Council, conveying the letter from Javier Solana, President of the NATO (North Atlantic Treaty Organization).",Letter,"United Nations|United Nations. Secretary-General|Annan, Kofi A. (Kofi Atta)|North Atlantic Treaty Organization","Kosovo; Yugoslavia",English,,"United Nations",PDF,UN0483,"United Nations","United Nations","Letters (Correspondence)",,,https://ccnydigitalscholarship.org/kofiannan/files/original/63e157104744c95a5223cf7a0152069a.pdf,Text,Letters,1,0
4885,https://ccnydigitalscholarship.org/kofiannan/items/show/4885,"Letter to Baboucarr-Blaise Ismaila Jagne, President of the Security Council, regarding the Kosovo crisis","21 June 1999","Kofi Annan",,"Letter from Secretary-General Kofi Annan to Baboucarr-Blaise Ismaila Jagne, President of the Security Council, conveying the letter and the draft agreement between the Government of Federal Republic of Yugoslavia and the United Nations on the Status of the International Presence in Kosovo and Metohija under the UN auspices.",Letter,"United Nations|United Nations. Secretary-General|Annan, Kofi A. (Kofi Atta)|Jovanovic, Vladislav; UN Interim Administration Mission in Kosovo (UNMIK); United Nations and Kosovo","Serbia and Montenegro; Kosovo",English,,"United Nations",PDF,UN0482,"United Nations","United Nations","Letters (Correspondence)",,,https://ccnydigitalscholarship.org/kofiannan/files/original/b2766e3794e9ace94d400f7906cdb8d1.pdf,Text,Letters,1,0
4886,https://ccnydigitalscholarship.org/kofiannan/items/show/4886,"Letter From the Ambassador Ernst Sucharipa to Kofi Annan","18 November 1998",,,"Letter from the Ambassador of Austria, Ernst Sucharipa to Secretary-General Kofi Annan, bringing his attention to the declaration by the Presidency of the European Union on the financial situation of the UN. Attached are also a letter F.M. Moys, Ambassador of the General Secretariat of the Council of the European Union to Annan and a letter from the Austrian Minister for Foreign Affairs, Dr. Wolfgang Schüssel to U.S. Secretary of State, Madeleine Albright.",Letter,"United Nations|United Nations. Secretary-General|Annan, Kofi A. (Kofi Atta)|Kofi Annan; Wolfgang Schüssel; Madeleine Albright; Financial issues, of the UN And financial crisis",,English,,"United Nations",PDF,UN0353,"United Nations","United Nations","Letters (Correspondence)",,,https://ccnydigitalscholarship.org/kofiannan/files/original/ad1eff04985191bcadbe3a644dc56212.pdf,Text,Letters,1,0
4887,https://ccnydigitalscholarship.org/kofiannan/items/show/4887,"Letter From Kofi Annan to the President of the Security Council A. Peter Burleigh","20 November 1998","Kofi Annan",,"Letter from Secretary-General Kofi Annan to the President of the Security Council, A. Peter Burleigh, informing him that Secretary-General decided to appoint Noel Sinclair to head the UN Political Office in Bougainville. Later Annan asks to bring this letter to the attention of the members of the Security Council.",Letter,"United Nations|United Nations. Secretary-General|Annan, Kofi A. (Kofi Atta)|Kofi Annan; Peter Burleigh; Bougainville and Peace agreement; Papua New Guinea and Peace process","Papua New Guinea",English,,"United Nations",PDF,UN0354,"United Nations","United Nations","Letters (Correspondence)",,,https://ccnydigitalscholarship.org/kofiannan/files/original/45b597e7813fda9380dacae908d83453.pdf,Text,Letters,1,0
4888,https://ccnydigitalscholarship.org/kofiannan/items/show/4888,"Letter From the President of the Security Council A. Peter Burleigh to Secretary-General Kofi Annan","17 November 1998",,,"Letter from A. Peter Burleigh, President of the Security Council, to Secretary-General Kofi Annan, informing him that his letter concerning the extension of the mandate of the UN Office in Burundi has been brought to the attention of the members of the Council.",Letter,"United Nations|United Nations. Secretary-General|Annan, Kofi A. (Kofi Atta)|Kofi Annan; Peter Burleigh; UN Office in Burundi (UNOB)",Burundi,English,,"United Nations",PDF,UN0350,"United Nations","United Nations","Letters (Correspondence)",,,https://ccnydigitalscholarship.org/kofiannan/files/original/efb1a41f42b80dbdba245e8cd5e02f30.pdf,Text,Letters,1,0
4890,https://ccnydigitalscholarship.org/kofiannan/items/show/4890,"Letter: Revision of the 1968 African Convention of the Conservation of Nature and Natural Resources","26 January 2002","Wolfgang Burhenne",,"Letter to Secretary-General Kofi Annan from Wolfgang E. Burhenne regarding the progress on the Revision of the African Convention.",Letter,"United Nations|United Nations. Secretary-General|Annan, Kofi A. (Kofi Atta)|Africa; UN Department of Economics and Social Affairs (DESA)",Africa,English,,"United Nations|Departmet Economic and Social Affairs 2002",PDF,UN1029,"United Nations",,"Letters (Correspondence)",,,https://ccnydigitalscholarship.org/kofiannan/files/original/81a61b1b2e8b3daa5779a44687633f60.pdf,Text,Letters,1,0
4891,https://ccnydigitalscholarship.org/kofiannan/items/show/4891,"Letter from Kofi Annan to Niels Helveg, Minister for Foreign Affairs of Denmark and other member countries of the ""Friends of the Secretary-General for Kosovo""","26 June 1999","Kofi Annan",,"Letter from Secretary-General Kofi Annan to Niels Helveg, Minister for Foreign Affairs of Denmark and other member countries of the ""Friends of the Secretary-General for Kosovo,"" inviting them to a foreign-minister level meeting of the group.",Letter,"United Nations|United Nations. Secretary-General|Annan, Kofi A. (Kofi Atta)|Resolution 1244 (Kosovo); Kosovo and Friends group",Kosovo,English,,"United Nations",PDF,UN0491,"United Nations","United Nations","Letters (Correspondence)",,,https://ccnydigitalscholarship.org/kofiannan/files/original/2de855ac9712e56ff93e972c32e56055.pdf,Text,Letters,1,0
4901,https://ccnydigitalscholarship.org/kofiannan/items/show/4901,"Letter to Yuji Ikeda, the Permanent Representative of Japan to the Comprehensive Nuclear-Test-Ban Treaty Organization (CTBTO), regarding the conference on facilitating the entry into force of the CTBT","28 September 1999","Kofi Annan",,"Letter from Kofi Annan to Yuji Ikeda, the Permanent Representative of Japan to the Comprehensive Nuclear Test Ban Treaty Organization (CTBTO), regarding the conference on facilitating the entry into force of the CTBT.",Letter,"United Nations|United Nations. Secretary-General|Annan, Kofi A. (Kofi Atta)|Wolfgang Hoffmann; Dhanapala, Jayantha; Nuclear disarmament",Austria,English,,"United Nations",PDF,UN0541,"United Nations","United Nations","Letters (Correspondence)",,,https://ccnydigitalscholarship.org/kofiannan/files/original/afd7448cf93bf832664d908f46461c82.pdf,Text,Letters,1,0
