﻿"Item Id","Item URI","Dublin Core:Title","Dublin Core:Date","Dublin Core:Creator","Dublin Core:Contributor","Dublin Core:Description","Dublin Core:Type","Dublin Core:Subject","Dublin Core:Coverage","Dublin Core:Language","Dublin Core:Relation","Dublin Core:Source","Dublin Core:Format","Dublin Core:Identifier","Dublin Core:Rights","Dublin Core:Publisher","Item Type Metadata:Original Format","PDF Text:Text",tags,file,itemType,collection,public,featured
8843,https://ccnydigitalscholarship.org/kofiannan/items/show/8843,"Note to the Secretary-General: Holds on applications under the oil-for-food programme","26 March 2001",,,"Internal note from Benon V. Sevan, the head of the Oil-for-Food Programme, to S. Iqbal Riza, transmitting a note to the Secretary-General regarding the holds on the program.","Internal memo",,Iraq,English,,"United Nations|UN Archive Collection: Relief OPS-OCHA Iraq Programme 2001 (Jan-Apr)",PDF,UN0841,"United Nations",,Memorandums,,"Internal memo,Iraq,Oil-For-Food Programme,Resolution",https://ccnydigitalscholarship.org/kofiannan/files/original/eeba1581231fa736faf5d03aef6c7c32.pdf,Text,"Internal Memo",1,0
8490,https://ccnydigitalscholarship.org/kofiannan/items/show/8490,"Note to Messrs. Guéhenno and Prendergast","16 October 2003","S. Iqbal Riza",,"Request by the Secretary-General for an analysis about Iraq","Internal memo",,,English,,"United Nations|UN Archive Collection: DPKO Department of Peacekeeping Operations - 2003",PDF,UN1324,"United Nations",,Memorandums,,"Internal memo,Iraq,Resolution",https://ccnydigitalscholarship.org/kofiannan/files/original/7c0e164b9e5a1a34db640ce0338a4529.PDF,Text,"Internal Memo",1,0
7264,https://ccnydigitalscholarship.org/kofiannan/items/show/7264,"Note to the Secretary-General","17 March 2005","Jan Egeland",,"This is a note regarding an event hosted by the Canadian Permanent Mission to celebrate the 5th Anniversary of the formulation of Security Council Resolution 1296.","Internal memo",,,English,,"United Nations|RELIEF OPS/OCHA - 2005 - Office for the Coordination of Humanitarian Affairs/Office of the Emergency Relief Coordinator",PDF,UN1664,"United Nations",,Memorandums,,"Armed Conflict,Civilians,Internal memo,Resolution",https://ccnydigitalscholarship.org/kofiannan/files/original/c82eaaad2970d012582204b7645b9eda.PDF,Text,"Internal Memo",1,0
8622,https://ccnydigitalscholarship.org/kofiannan/items/show/8622,"Note to the Secretary-General","12 December 2001","Hans Corell, Under-Secretary-General for Legal Affairs",,"Note to the Secretary-General Hans Corell informs Kofi Annan about Security Council Resolutions 1267 (1999) and 1333 (2000), the Resolutions discuss freezing funds and other financial assets controlled directly or indirectly by the Taliban or owned by individuals and entities associated with Osama Bin Laden as designated by the committee established under Resolution 1267. On the other hand, Security Council Resolution 1373 is about states being required to ""freeze without delay funds and other financial assets or economic resources of persons who commit, or attempt to commit, terrorist acts or participate in or facilitate the commission of terrorist acts.","Internal memo",,,English,,"United Nations|UN Archive Collection: OLA Office of Legal Affairs 2001 (Oct-Dec)",PDF,UN1015,"United Nations",,Memorandums,,"Committee,Internal memo,Resolution,Security Council Resolutions,United States",https://ccnydigitalscholarship.org/kofiannan/files/original/1ec4a7ccc4da841d1475aaf7e8295a18.PDF,Text,"Internal Memo",1,0
8304,https://ccnydigitalscholarship.org/kofiannan/items/show/8304,"Inter-office memorandum to Kofi Annan from Hans Corell, Under-Secretary-General for Legal Affairs","6 December 1997","Hans Corell",,"Inter-office memorandum from Hans Corell, Under-Secretary-General for Legal Affairs, through S. Iqbal Riza, Chef de Cabinet of the Secretary-General, to Secretary-General Kofi Annan informing Annan that Ambasador Hamdoon and Corell concluded correspondence renewing the Memorandum of Understanding on the implementation of Security Council resolution 986 (1995).","Internal memo",,Iraq,English,"Security Council Resolution 986 (1995)|Security Council Resolution 1143 (1997)","United Nations",PDF,UN0147,"United Nations",,Memorandums,,"Food Aid,Food Aid In Iraq,Hans Corell,Internal memo,Iraq,Nizar Hamdoon,Oil-For-Food Programme,Resolution,S. Iqbal Riza,UN Security Council Resolution 1143",https://ccnydigitalscholarship.org/kofiannan/files/original/581d7bb2aa7a5bc11b9e794a24931ca6.pdf,Text,"Internal Memo",1,0
8607,https://ccnydigitalscholarship.org/kofiannan/items/show/8607,"Note to the Secretary-General: Security Council Meeting Monday, 23 September 2002","20 September 2002","Elisabeth Lindenmayer",,"This is a note from Elisabeth Lindenmayer to Kofi Annan pertaining to the Security Council meeting on Monday, 23 September 2002. The document has a copy of Kofi Annan's programme for the day as well as a copy of a draft resolution forwarded to them by the council. The meeting pertains to the escalation of violence in Palestine. Also attached is a letter from Dr . Nasser Al Kidwa, Ambassador of the Permanent Observer Mission of Palestine to the United Nations and Chairman of the Arab Group, asking for this meeting to convene.|Note: Handwritten note by Kofi Annan: ""If it starts on time I shall be there 20 minutes, I need not speak. Please ensure that I am not too stretched before press conference, KA 20/9""","Internal memo",,Palestine,English,,"United Nations|UN Archive Collection: EOSG 2002 Executive Office of the Secretary General",PDF,UN1125,"United Nations",,Memorandums,,"Elisabeth Lindenmayer,Internal memo,Israel,Middle East,Nasser Al-Kidwa,Palestine,Resolution,UN Security Council",https://ccnydigitalscholarship.org/kofiannan/files/original/924a8d58edd18ea1f27c0e624a59dce6.PDF,Text,"Internal Memo",1,0
8789,https://ccnydigitalscholarship.org/kofiannan/items/show/8789,"Note to Mr. Corell: Request for legal opinion","22 March 2001","Benon V. Sevan",,"Internal note from Benon V. Sevan, the head of the Oil-for-Food Programme to Corell Hans, Under-Secretary-General for Legal Affairs, asking for a legal opinion regarding difficulties in obtaining the necessary visas to enter Iraq for the United Nations personnel.","Internal memo",,Iraq,English,,"United Nations|UN Archive Collection: Relief OPS-OCHA Iraq Programme 2001 (Jan-Apr)",PDF,UN0537-1,"United Nations",,Memorandums,,"Internal memo,Iraq,Iraq and Memorandum Understanding (1996),Oil-For-Food Programme,Resolution",https://ccnydigitalscholarship.org/kofiannan/files/original/78acf1ab37366947f1107cd38fb0d3cb.pdf,Text,"Internal Memo",1,0
8112,https://ccnydigitalscholarship.org/kofiannan/items/show/8112,"Note to Messrs Gambari, Guehenno and Williams","27 November 2006","Alicia Bárcena",,"This document is a note about reporting resolution 1701 (2006) to the Security Council in letter format.","Internal memo",,,English,,"United Nations|UN Archive Collection: DPA - Security Council Matters - General 2006",PDF,UN2262,"United Nations",,Memorandums,,"Internal memo,Resolution",https://ccnydigitalscholarship.org/kofiannan/files/original/2eb532b672eefbf736c5091e23b69bbc.PDF,Text,"Internal Memo",1,0
